{"text_format":"1","workbook":"xlsx","n_sheets":20,"sheets":["Project Info","Incentive Form","Savings Summary","HVAC","HVAC Lookups","Cooling NC","Cooling ROB","Cooling ER","Heating NC ROB","Heating ER","Heating Resistance","Wall Insulation","Wall Insulation Lookup","Floor Insulation","Floor Insulation Lookup","Air Infiltration","Air Infiltration Lookup","Cool Roofs","Cool Roofs Lookup","Version Log"],"not_rendered":{"charts":0,"images":1,"macros":1,"external_links":0,"defined_names":30,"comments":0,"pivot_tables":0},"unopened":[],"bounds":{"document_bytes":16777216,"sheet_cells":100000,"rows_first":2000,"rows_last":500,"rows_between":2000,"halvings":0,"cell_chars":16384,"cell_head_chars":4096},"cells_cut":0,"cells_raw":0,"read":"whole","date_system":"1900"}

{"sheet":"Project Info","index":0,"n_rows":25,"n_cols":8,"rows_kept":25,"cut":false,"hidden":false,"merged":[]}
["v21.0","El Paso Electric Residential/Income Qualified Measure Calculator"]
[]
[]
[null,"Multi-Family Name:",null,"Contractor Name:",null,null,null,"Select Measure:"]
[null,"Contact Name:",null,"Address:"]
[null,"Address:",null,"City:"]
{"$rows_left_out":20}
{"sheet":"Incentive Form","index":1,"n_rows":49,"n_cols":10,"rows_kept":49,"cut":false,"hidden":false,"merged":[[48,0,49,10],[34,0,38,10]]}
["",null,null,"2021 EPE RESIDENTIAL ENERGY EFFICIENY PROGRAMS"]
[]
[null,null,null,"Incentive Form"]
[]
[null,null,null,"Program:",{"$f":"Program","v":0}]
[null,null,null,"• Income Eligibility Form must be submitted for all Income Qualified Projects"]
{"$rows_left_out":44}
{"sheet":"Savings Summary","index":2,"n_rows":12,"n_cols":6,"rows_kept":12,"cut":false,"hidden":false,"merged":[]}
[null,"Savings Summary"]
[null,null,"Total Summer Peak kW Savings","Total Winter Peak kW Savings","Total kWh Savings","Total Incentive"]
[null,null,{"$f":"SUM(C6:C12)","v":0},0,0,{"$f":"SUM(F6:F12)","v":0}]
[]
[null,"Measure Name","Summer Peak kW Savings","Winter Peak kW Savings","kWh Savings","Incentive"]
[null,"HVAC - New Construction",{"$f":"SUMIF(HVAC!$B7:$B11,\"New Construction\",HVAC!P7:P11)","v":0},{"$f":"SUMIF(HVAC!$B7:$B11,\"New Construction\",HVAC!Q7:Q11)","v":0},{"$f":"SUMIF(HVAC!B7:B11,\"New Construction\",HVAC!O7:O11)","v":0},{"$f":"SUMIF(HVAC!B7:B11,\"New Construction\",HVAC!R7:R11)","v":0}]
{"$rows_left_out":7}
{"sheet":"HVAC","index":3,"n_rows":11,"n_cols":75,"rows_kept":11,"cut":false,"hidden":true,"merged":[[4,71,4,74],[4,53,4,70],[4,19,4,31],[2,1,2,6],[4,32,4,38],[4,39,4,45],[4,46,4,52],[4,2,4,4],[4,5,4,12],[4,14,4,17],[4,1,5,1]]}
[null,null,null,null,null,null,null,null,null,null,null,null,null,null,null,null,null,null,null,"Hide","Hide","Hide","Hide","Hide","Hide","Hide","Hide","Hide","Hide","Hide","Hide","Hide","Hide","Hide","Hide","Hide","Hide","Hide","Hide","Hide","Hide","Hide","Hide","Hide","Hide","Hide","Hide","Hide","Hide","Hide","Hide","Hide","Hide","Hide","Hide","Hide","Hide","Hide","Hide","Hide","Hide","Hide","Hide","Hide","Hide","Hide","Hide","Hide","Hide","Hide","Hide","Hide","Hide","Hide","Hide"]
[]
[null,"HVAC & AC Mini Splits"]
[]
[null,"Project Type","Removed Equipment",null,null,"New Equipment",null,null,null,null,null,null,null,null,"Savings",null,null,null,null,"Equipment Lookups",null,null,null,null,null,null,null,null,null,null,null,null,"New Construction Savings (single unit)",null,null,null,null,null,null,"Replace-On-Burnout Savings (single unit)",null,null,null,null,null,null,"Early Replacement Savings (single unit)",null,null,null,null,null,null,"NPV ER calculations (single unit)",null,null,null,null,null,null,null,null,null,null,null,null,null,null,null,null,null,"Final Savings"]
[null,null,"Type\n(ER/ROB Only)","Size (BTUH)\n(ER/ROB Only)","Manufactured Year\n(ER Only)","Manufacturer/Model","AHRI Reference #","Equipment Type","Size (BTUH)","Full-Load (EER)","Part-Load (SEER)","Heating (HSPF)\nHeat Pump Only","Unit Quantity",null,"Annual Energy Savings\n[kWh]","Summer Demand Savings\n[kW]","Winter Demand Savings\n[kW]","Project Incentive",null,"Old Nom Tons","Old Btuh Range","New Nom Tons","BTUH Index","Btuh Range","SEER Index","SEER Range","HSPF Range","Size Change?","Base SEER (ER)","Type\n(HP)","Heating Baseline\n(HP)","Base HSPF (HP ER)","Cooling Index","Heating Index","kWh cool","kWh heat","kWh c+h","Summer kW","Winter kW","Cooling Index","Heating Index","kWh cool","kWh heat","kWh c+h","Summer kW","Winter kW","Cooling Index","Heating Index","kWh cool","kWh heat","kWh c+h","Summer kW","Winter kW","Equipment Age (yrs)","RUL","EUL (yrs)","YearsST","NPV kWs FT","NPV kWs ST","NPV kWw FT","NPV kWw ST","NPV kWh FT","NPV kWh ST","NPV kWs Total","NPV kWw Total","NPV kWh Total","NPV kWEUL","NPV kWhEUL","kWs Weighted","kWw Weighted","kWh Weighted","Peak Period","kW Summer","kW Winter","kWh"]
{"$rows_left_out":6}
{"sheet":"HVAC Lookups","index":4,"n_rows":66,"n_cols":21,"rows_kept":66,"cut":false,"hidden":true,"merged":[]}
[null,"Table 1: Equipment Sizes",null,null,null,"Table 2: SEER Ranges",null,null,"Table 3: HSPF Ranges",null,null,null,"Table 4: Early Replacement Info"]
[null,"Btuh Min","Btuh Range","Nom Tons",null,"SEER Min","SEER Range",null,"HSPF Min","HSPF Range",null,null,"Manuf Year","Age of Replaced Unit","AC Remaining Useful Life (years)","HP Remaining Useful Life (years)","Baseline SEER","Baseline HSPF (Heat Pump)","Baseline HSPF (Electric Resistance)",null,"Equipment Types"]
[null,0,"< 15,000",1,null,14.5,"14.5-14.9",null,8.5,"8.5-8.9",null,null,"?","?",7,6,10,6.8,3.41,null,"Central A/C with Gas Heat"]
[null,15000,"15,000-20,999",1.5,null,15,"15.0-15.9",null,9,"9.0-9.4",null,null,{"$f":"M5-1","v":1996},25,0,0,10,6.8,3.41,null,"Central A/C with Electric Heat"]
[null,21000,"21,000-26,999",2,null,16,"16.0-16.9",null,9.5,"9.5-9.9",null,null,1997,24,1,0,10,6.8,3.41,null,"Central Heat Pump"]
[null,27000,"27,000-32,999",2.5,null,17,"17.0-17.9",null,10,"10.0-10.4",null,null,1998,23,2,0,10,6.8,3.41,null,"Mini Split A/C"]
{"$rows_left_out":61}
{"sheet":"Cooling NC","index":5,"n_rows":12,"n_cols":18,"rows_kept":12,"cut":false,"hidden":true,"merged":[[2,0,3,0],[2,10,3,10]]}
[]
["Table A‑5: Energy Savings (Cooling kWh) for 14.0 SEER New Construction Baseline—Zone 5",null,null,null,null,null,null,null,null,null,"Table A‑45: Summer Demand Savings for 14.0 SEER New Construction Baseline—Zone 5"]
["Size (Btuh)","SEER Range",null,null,null,null,null,null,null,null,"Size (Btuh)","SEER Range"]
[null,"14.5–14.9","15.0–15.9","16.0–16.9","17.0–17.9","18.0–20.9","21.0-23.9","24.0+",null,null,null,"14.5–14.9","15.0–15.9","16.0–16.9","17.0–17.9","18.0–20.9","21.0-23.9","24.0+"]
["< 15,000",60,115,213,378,437,582,692,null,null,"< 15,000",0.04,0.08,0.14000000000000001,0.13,0.17,0.26,0.33]
["15,000-20,999",90,172,320,566,655,873,1038,null,null,"15,000-20,999",0.06,0.11,0.21,0.19,0.26,0.39,0.49]
{"$rows_left_out":7}
{"sheet":"Cooling ROB","index":6,"n_rows":79,"n_cols":22,"rows_kept":79,"cut":false,"hidden":true,"merged":[]}
["SEER Range"]
[null,null,"Table A‑10: Energy Savings (Cooling kWh) for 13.08 SEER Replace-on-Burnout Baseline—Zone 5",null,null,null,null,null,null,null,null,null,null,"Table A‑50: Summer Demand Savings for 13.08 SEER Replace-on-Burnout Baseline—Zone 5"]
[{"$f":"IF(C4=\"Size (Btuh) Post\",LEFT(C3,SEARCH(\"SEER\",C3)-2),A2)","v":"14.5-14.9"},null,"14.5-14.9 SEER",null,null,null,null,null,null,null,null,null,null,"14.5-14.9 SEER"]
["14.5-14.9",null,"Size (Btuh) Post","< 15,000","15,000-20,999","21,000-26,999","27,000-32,999","33,000-38,999","39,000-44,999","45,000-53,999","54,000-64,999",null,null,"Size (Btuh) Post","< 15,000","15,000-20,999","21,000-26,999","27,000-32,999","33,000-38,999","39,000-44,999","45,000-53,999","54,000-64,999"]
["14.5-14.9",null,"Size (Btuh) Pre",null,null,null,null,null,null,null,null,null,null,"Size (Btuh) Pre"]
["14.5-14.9",null,"< 15,000",165,null,null,null,null,null,null,null,null,null,"< 15,000",0.11]
{"$rows_left_out":74}
{"sheet":"Cooling ER","index":7,"n_rows":158,"n_cols":22,"rows_kept":158,"cut":false,"hidden":true,"merged":[]}
["Baseline SEER","SEER Range"]
[{"$f":"IFERROR(_xlfn.NUMBERVALUE(MID(C2,SEARCH(\"SEER Early\",C2)-6,5)),#REF!)","v":12.44},null,"Table A‑19: Energy Savings (Cooling kWh) for 12.44 SEER Early Retirement Baseline—Zone 5",null,null,null,null,null,null,null,null,null,null,"Table A‑59: Summer Demand Savings for 12.44 SEER Early Retirement Baseline—Zone 5"]
[{"$f":"IFERROR(_xlfn.NUMBERVALUE(MID(C3,SEARCH(\"SEER Early\",C3)-6,5)),A2)","v":12.44},{"$f":"IF(C4=\"Size (Btuh) Post\",LEFT(C3,SEARCH(\"SEER\",C3)-2),B2)","v":"14.5-14.9"},"14.5-14.9 SEER",null,null,null,null,null,null,null,null,null,null,"14.5-14.9 SEER"]
[12.44,"14.5-14.9","Size (Btuh) Post","< 15,000","15,000-20,999","21,000-26,999","27,000-32,999","33,000-38,999","39,000-44,999","45,000-53,999","54,000-64,999",null,null,"Size (Btuh) Post","< 15,000","15,000-20,999","21,000-26,999","27,000-32,999","33,000-38,999","39,000-44,999","45,000-53,999","54,000-64,999"]
[12.44,"14.5-14.9","Size (Btuh) Pre",null,null,null,null,null,null,null,null,null,null,"Size (Btuh) Pre"]
[12.44,"14.5-14.9","< 15,000",247,null,null,null,null,null,null,null,null,null,"< 15,000",0.16]
{"$rows_left_out":153}
{"sheet":"Heating NC ROB","index":8,"n_rows":180,"n_cols":22,"rows_kept":180,"cut":false,"hidden":true,"merged":[]}
["HSPF Range","Type"]
[null,null,"Table A‑25: Central Energy Savings (Heating kWh) for 8.2 HSPF Baseline—Zone 5",null,null,null,null,null,null,null,null,null,null,"Table A‑65: Central Winter Demand Savings for 8.2 HSPF Baseline—Zone 5"]
[{"$f":"IF(C4=\"Size (Btuh) Post\",LEFT(C3,SEARCH(\"HSPF\",C3)-2),A2)","v":"8.5-8.9"},"Central","8.5-8.9 HSPF",null,null,null,null,null,null,null,null,null,null,"8.5-8.9 HSPF"]
[{"$f":"IF(C5=\"Size (Btuh) Post\",LEFT(C4,SEARCH(\"HSPF\",C4)-2),A3)","v":"8.5-8.9"},"Central","Size (Btuh) Post","< 15,000","15,000-20,999","21,000-26,999","27,000-32,999","33,000-38,999","39,000-44,999","45,000-53,999","54,000-64,999",null,null,"Size (Btuh) Post","< 15,000","15,000-20,999","21,000-26,999","27,000-32,999","33,000-38,999","39,000-44,999","45,000-53,999","54,000-64,999"]
["8.5-8.9","Central","Size (Btuh) Pre",null,null,null,null,null,null,null,null,null,null,"Size (Btuh) Pre"]
["8.5-8.9","Central","< 15,000",81,null,null,null,null,null,null,null,null,null,"< 15,000",0.03]
{"$rows_left_out":175}
{"sheet":"Heating ER","index":9,"n_rows":360,"n_cols":23,"rows_kept":360,"cut":false,"hidden":true,"merged":[]}
["Baseline HSPF","HSPF Range","Type"]
[{"$f":"IFERROR(_xlfn.NUMBERVALUE(MID(D2,SEARCH(\"HSPF Base\",D2)-4,3)),#REF!)","v":7.7},null,null,"Table A‑39: Central Energy Savings (Heating kWh) for 7.7 HSPF Baseline—Zone 5",null,null,null,null,null,null,null,null,null,null,"Table A‑79: Central Winter Demand Savings for 7.7 HSPF Baseline—Zone 5"]
[{"$f":"IFERROR(_xlfn.NUMBERVALUE(MID(D3,SEARCH(\"HSPF Base\",D3)-4,3)),A2)","v":7.7},{"$f":"IF(D4=\"Size (Btuh) Post\",LEFT(D3,SEARCH(\"HSPF\",D3)-2),B2)","v":"8.5-8.9"},"Central","8.5-8.9 HSPF",null,null,null,null,null,null,null,null,null,null,"8.5-8.9 HSPF"]
[7.7,"8.5-8.9","Central","Size (Btuh) Post","< 15,000","15,000-20,999","21,000-26,999","27,000-32,999","33,000-38,999","39,000-44,999","45,000-53,999","54,000-64,999",null,null,"Size (Btuh) Post","< 15,000","15,000-20,999","21,000-26,999","27,000-32,999","33,000-38,999","39,000-44,999","45,000-53,999","54,000-64,999"]
[7.7,"8.5-8.9","Central","Size (Btuh) Pre",null,null,null,null,null,null,null,null,null,null,"Size (Btuh) Pre"]
[7.7,"8.5-8.9","Central","< 15,000",197,null,null,null,null,null,null,null,null,null,"< 15,000",0.08]
{"$rows_left_out":355}
{"sheet":"Heating Resistance","index":10,"n_rows":180,"n_cols":22,"rows_kept":180,"cut":false,"hidden":true,"merged":[]}
["HSPF Range","Type"]
[null,null,"Table A‑30: Central Energy Savings (Heating kWh) for 3.41 HSPF Baseline—Zone 5",null,null,null,null,null,null,null,null,null,null,"Table A‑70: Central Winter Demand Savings for 3.41 HSPF Baseline—Zone 5"]
[{"$f":"IF(C4=\"Size (Btuh) Post\",LEFT(C3,SEARCH(\"HSPF\",C3)-2),A2)","v":"8.5-8.9"},"Central","8.5-8.9 HSPF",null,null,null,null,null,null,null,null,null,null,"8.5-8.9 HSPF"]
["8.5-8.9","Central","Size (Btuh) Post","< 15,000","15,000-20,999","21,000-26,999","27,000-32,999","33,000-38,999","39,000-44,999","45,000-53,999","54,000-64,999",null,null,"Size (Btuh) Post","< 15,000","15,000-20,999","21,000-26,999","27,000-32,999","33,000-38,999","39,000-44,999","45,000-53,999","54,000-64,999"]
["8.5-8.9","Central","Size (Btuh) Pre",null,null,null,null,null,null,null,null,null,null,"Size (Btuh) Pre"]
["8.5-8.9","Central","< 15,000",2563,null,null,null,null,null,null,null,null,null,"< 15,000",1]
{"$rows_left_out":175}
{"sheet":"Wall Insulation","index":11,"n_rows":14,"n_cols":4,"rows_kept":14,"cut":false,"hidden":true,"merged":[[1,1,1,3],[2,1,2,3]]}
[]
[null,"Wall Insulation"]
[null,"Instructions: Enter the project information in the yellow cells below."]
[]
[null,"Cooling Type"]
[null,"Heating Type"]
{"$rows_left_out":9}
{"sheet":"Wall Insulation Lookup","index":12,"n_rows":98,"n_cols":19,"rows_kept":98,"cut":false,"hidden":true,"merged":[[9,2,15,5],[1,2,7,5]]}
[]
[null,"Baseline Condition:","The baseline is considered to be a house with little or no wall insulation in the wall cavity. For those homes for which a minimal level of insulation is encountered, the baseline is established at R-4. This baseline should be used to represent homes for which installed insulation covers a very limited amount of the wall area to be treated, is significantly degraded, and/or is less than an inch thick. Homes with more than this base level of insulation are not eligible for the measure. Baseline homes may have either 2x4 or 2x6 construction.",null,null,null,null,null,null,"Climate Zone","Base Case Wall Insulation","Cooling Type","Heating Type","Type of Wall","New Material","Cooling Savings","Heating Savings","Summer Demand Savings","Winter Demand Savings"]
[null,null,null,null,null,null,null,null,null,"Climate Zone 5: West","Uninsulated","Refrigerated Air","Gas","2x4","Fiberglass batt or cellulose",0.76,0.09,6.5200000000000002E-4,2.0599999999999999E-5]
[null,null,null,null,null,null,null,null,null,"Climate Zone 5: West","Uninsulated","Refrigerated Air","Electric Resistance","2x4","Fiberglass batt or cellulose",0.76,2.4,6.5200000000000002E-4,6.78E-4]
[null,null,null,null,null,null,null,null,null,"Climate Zone 5: West","Uninsulated","Refrigerated Air","Heat Pump","2x4","Fiberglass batt or cellulose",0.76,0.98,6.5200000000000002E-4,2.8400000000000002E-4]
[null,null,null,null,null,null,null,null,null,"Climate Zone 5: West","Uninsulated","Refrigerated Air","Gas","2x4","Fiberglass batt or cellulose",0.76,0.09,6.5200000000000002E-4,2.0599999999999999E-5]
{"$rows_left_out":93}
{"sheet":"Floor Insulation","index":13,"n_rows":12,"n_cols":4,"rows_kept":12,"cut":false,"hidden":true,"merged":[[1,1,1,3],[2,1,2,3]]}
[]
[null,"Floor Insulation"]
[null,"Instructions: Enter the project information in the yellow cells below."]
[]
[null,"Home Type"]
[null,"Cooling Type"]
{"$rows_left_out":7}
{"sheet":"Floor Insulation Lookup","index":14,"n_rows":30,"n_cols":12,"rows_kept":30,"cut":false,"hidden":true,"merged":[[1,2,3,5],[5,2,15,5]]}
[]
[null,"Baseline Condition:","The baseline is considered to be a house with pier and beam construction and no floor insulation against the floor of the conditioned area. "]
[null,null,null,null,null,null,null,"Climate Zone","Home Type","Type","Energy Savings/sf","Demand Savings/sf"]
[null,null,null,null,null,null,null,"Climate Zone 5: West","Site-built Home","Refrigerated Air",-0.16,6.2899999999999999E-6]
[null,null,null,null,null,null,null,"Climate Zone 5: West","Site-built Home","Evaporative",-7.0000000000000007E-2,-1.3400000000000001E-6]
[null,"High-efficiency Condition:","A floor insulation level of R-19 is recommended for site-built homes throughout Texas as prescribed by DOE and Texas Department of Housing and Community Affairs (TDHCA) programs. Batt insulation is recommended in most cases and must have the vapor barrier installed facing up and against the floor or conditioned area. Insulation should be attached or secured so that it can reasonably be expected to remain in place for at least 10 years. Typical floor construction depth of manufactured homes usually does not allow R-19 batt to be installed within the floor joists, so R-15 loose-fill insulation is recommended by TDHCA. A minimum of 24-inch clearance from the bottom of the insulation to the ground is required by the Occupational Safety and Health Association (OSHA).",null,null,null,null,"Climate Zone 5: West","Manufactured Home","Refrigerated Air",-0.13,8.2999999999999999E-7]
{"$rows_left_out":25}
{"sheet":"Air Infiltration","index":15,"n_rows":13,"n_cols":4,"rows_kept":13,"cut":false,"hidden":true,"merged":[[1,1,1,3],[2,1,2,3]]}
[]
[null,"Air Infiltration"]
[null,"Instructions: Enter the project information in the yellow cells below."]
[]
[null,"Cooling Type"]
[null,"Heating Type"]
{"$rows_left_out":8}
{"sheet":"Air Infiltration Lookup","index":16,"n_rows":37,"n_cols":11,"rows_kept":37,"cut":false,"hidden":true,"merged":[[1,2,3,5],[5,2,15,5],[12,8,12,10]]}
[]
[null,"Baseline Condition:","The baseline for this measure is the existing leakage rate of the treated residence. The existing leakage rate should be capped to account for the fact that the deemed savings values per CFM50 leakage reduction are only applicable up to a point where the existing HVAC equipment would run continuously. Beyond that point, energy use will no longer increase linearly with an increase in leakage."]
[null,null,null,null,null,null,null,"Climate Zone","Type","Energy Savings/CFM50","Demand Savings/CFM50"]
[null,null,null,null,null,null,null,"Climate Zone 5: West","Refrigerated Air",7.0000000000000007E-2,9.3999999999999994E-5]
[null,null,null,null,null,null,null,"Climate Zone 5: West","Evaporative",0,0]
[null,"High-efficiency Condition:","Blower door air pressure measurements must also be used to ensure that post-treatment air infiltration rates are not less than those set forth by the standard in Equation 54, based on floor area and the number of bedrooms.206 These calculated minimum CFM50 values assume two occupants for a one-bedroom dwelling unit and an additional person for each additional bedroom. At the utility’s discretion, this minimum CFM50 requirement may be enforced as an eligibility requirement. Otherwise, savings may be claimed for projects where the measured final infiltration rate is less than the minimum allowable ventilation rate if the following conditions are met:\n• Mechanical ventilation is present or introduced in compliance with ASHRAE 62.2-2019\n• Post-treatment infiltration rate is reported as the actual measured CFM50 result\n• Savings are calculated using the TRM minimum allowable ventilation rate with no additional savings claimed for CFM reduction below this amount",null,null,null,null,"Climate Zone 5: West","Electric Resistance",0.88,2.92E-4]
{"$rows_left_out":32}
{"sheet":"Cool Roofs","index":17,"n_rows":15,"n_cols":4,"rows_kept":15,"cut":false,"hidden":true,"merged":[[1,1,1,3],[2,1,2,3]]}
[]
[null,"Cool Roofs"]
[null,"Instructions: Enter the project information in the yellow cells below."]
[]
[null,"Cooling Type"]
[null,"Heating Type"]
{"$rows_left_out":10}
{"sheet":"Cool Roofs Lookup","index":18,"n_rows":46,"n_cols":21,"rows_kept":46,"cut":false,"hidden":true,"merged":[[2,16,2,17],[2,18,2,20],[1,2,3,5],[5,2,15,5],[2,10,3,10],[2,11,2,12],[2,13,2,15]]}
[]
[null,"Baseline Condition:","The baseline condition is an existing home with a standard medium- or dark-colored roof.",null,null,null,null,null,null,null,null,"Energy Savings",null,null,null,null,"Demand Savings"]
[null,null,null,null,null,null,null,null,null,"Insulation","Installed Roof Material 3-Year Reflectance","Cooling Savings",null,"Heating Savings",null,null,"Summer",null,"Winter"]
[null,null,null,null,null,null,null,"Insulation Type","Roof Slope]","R-value",null,"Refrigerated Air","Evaporative Cooling","Gas","Electric Resistance","Heat Pump","Refrigerated Air","Evaporative Cooling","Gas","Electric Resistance","Heat Pump"]
[null,null,null,null,null,null,null,"Ceiling","Steep","≤ R-8","0.15 - 0.29",0.04,0.02,0,-0.04,-0.01,2.72E-5,8.9600000000000006E-6,-2.41E-7,-1.98E-5,-7.9799999999999998E-6]
[null,"High-efficiency Condition:","The measure requires installation of roof products that have been rated by the Cool Roof Rating Council (CRRC) and demonstrate compliance with ENERGY STAR® certified roof product performance specifications for the relevant roof application. ENERGY STAR® test criteria allows for products already participating in the CRRC Product Rating Program to submit solar reflectance and thermal emittance product information derived from CRRC certification.",null,null,null,null,"Ceiling","Steep","≤ R-8","0.3 – 0.49",0.21,0.08,-0.01,-0.2,-7.0000000000000007E-2,1.27E-4,6.0000000000000002E-5,-4.8300000000000003E-6,-1.03E-4,-4.1399999999999997E-5]
{"$rows_left_out":41}
{"sheet":"Version Log","index":19,"n_rows":10,"n_cols":6,"rows_kept":10,"cut":false,"hidden":true,"merged":[[1,1,1,5]]}
[]
[null,"Version Log"]
[]
[null,"Original Author:",null,"Adam Groenhuyzen, Rodrigo Bonilla","QA/QC Engineer(s):","Adam Groenhuyzen, \nRodrigo Bonilla"]
[null,"Primary Developer:",null,null,"Senior Engineer Approval:","Boone Drummond"]
[]
{"$rows_left_out":4}