{"text_format":"1","workbook":"xlsx","n_sheets":20,"sheets":["Project Info","Incentive Form","Savings Summary","HVAC","HVAC Lookups","Cooling NC","Cooling ROB","Cooling ER","Heating NC ROB","Heating ER","Heating Resistance","Wall Insulation","Wall Insulation Lookup","Floor Insulation","Floor Insulation Lookup","Air Infiltration","Air Infiltration Lookup","Cool Roofs","Cool Roofs Lookup","Version Log"],"not_rendered":{"charts":0,"images":1,"macros":1,"external_links":0,"defined_names":30,"comments":0,"pivot_tables":0},"unopened":[],"bounds":{"document_bytes":16777216,"sheet_cells":100000,"rows_first":2000,"rows_last":500,"rows_between":2000,"halvings":0,"cell_chars":16384,"cell_head_chars":4096},"cells_cut":0,"cells_raw":0,"read":"whole","date_system":"1900"}

{"sheet":"Project Info","index":0,"n_rows":25,"n_cols":8,"rows_kept":25,"cut":false,"hidden":false,"merged":[]}
["v21.0","El Paso Electric Residential/Income Qualified Measure Calculator"]
[]
[]
[null,"Multi-Family Name:",null,"Contractor Name:",null,null,null,"Select Measure:"]
[null,"Contact Name:",null,"Address:"]
[null,"Address:",null,"City:"]
[null,"City:",null,"Zip Code:"]
[null,"Zip Code:",null,"Phone:"]
[null,"County:",null,"Email:"]
[null,"Phone:"]
[null,"Email:"]
[null,"Number of Units:"]
[]
[null,"Heating Type:\n(Select One)"]
[]
[null,"Water Heater Type:\n(Select One)"]
[]
[null,"Cooling Type:\n(Select One)"]
[]
[null,"Program Type:\n(Select One)",null,{"$f":"IFERROR(VLOOKUP(Program,C24:D25,2,FALSE),0)","v":0}]
[]
[]
[null,null,"Program Name:","Incentive ($/kW)"]
[null,null,"Residential",350]
[null,null,"Income Qualified",450]

{"sheet":"Incentive Form","index":1,"n_rows":49,"n_cols":10,"rows_kept":49,"cut":false,"hidden":false,"merged":[[48,0,49,10],[34,0,38,10]]}
["",null,null,"2021 EPE RESIDENTIAL ENERGY EFFICIENY PROGRAMS"]
[]
[null,null,null,"Incentive Form"]
[]
[null,null,null,"Program:",{"$f":"Program","v":0}]
[null,null,null,"• Income Eligibility Form must be submitted for all Income Qualified Projects"]
["Multi-Family Name",null,null,null,null,null,null,null,"Phone"]
[{"$f":"'Project Info'!$C4","v":0},null,null,null,null,null,null,null,{"$f":"'Project Info'!$C10","v":0}]
["Contact Name",null,null,null,null,null,null,null,"Email"]
[{"$f":"'Project Info'!C5","v":0},null,null,null,null,null,null,null,{"$f":"'Project Info'!C11","v":0}]
["Address",null,null,null,null,null,null,null,"Number of Units"]
[{"$f":"'Project Info'!$C6","v":0},null,null,null,null,null,null,null,{"$f":"'Project Info'!C12","v":0}]
["City",null,null,null,"State",null,"Zip Code",null,"County"]
[{"$f":"'Project Info'!$C7","v":0},null,null,null,"TX",null,{"$f":"'Project Info'!$C8","v":0},null,{"$f":"'Project Info'!$C9","v":0}]
["Heating Type",null,null,null,"Water Heater Type",null,null,null,"Cooling Type"]
[{"$f":"'Project Info'!C14","v":0},null,null,null,{"$f":"'Project Info'!C16","v":0},null,null,null,{"$f":"'Project Info'!C18","v":0}]
[]
["Project Summary",null,null,null,"kW",null,"kWh",null,"Incentive"]
["HVAC - New Construction",null,null,null,{"$f":"SUM('Savings Summary'!C6:D6)","v":0},null,{"$f":"'Savings Summary'!E6","v":0},null,{"$f":"'Savings Summary'!F6","v":0}]
["HVAC - Replace On Burnout",null,null,null,{"$f":"SUM('Savings Summary'!C7:D7)","v":0},null,{"$f":"'Savings Summary'!E7","v":0},null,{"$f":"'Savings Summary'!F7","v":0}]
["HVAC - Early Retirement",null,null,null,{"$f":"SUM('Savings Summary'!C8:D8)","v":0},null,{"$f":"'Savings Summary'!E8","v":0},null,{"$f":"'Savings Summary'!F8","v":0}]
["Wall Insulation",null,null,null,{"$f":"SUM('Savings Summary'!C9:D9)","v":0},null,{"$f":"'Savings Summary'!E9","v":0},null,{"$f":"'Savings Summary'!F9","v":0}]
["Air Infiltration",null,null,null,{"$f":"SUM('Savings Summary'!C11:D11)","v":0},null,{"$f":"'Savings Summary'!E11","v":0},null,{"$f":"'Savings Summary'!F11","v":0}]
["Cool Roofs",null,null,null,{"$f":"SUM('Savings Summary'!C12:D12)","v":0},null,{"$f":"'Savings Summary'!E12","v":0},null,{"$f":"'Savings Summary'!F12","v":0}]
[]
[]
[]
[]
[null,null,null,null,"Total kW",null,"Total kWh",null,"Total Incentive"]
[null,null,null,null,{"$f":"'Savings Summary'!C3","v":0},null,{"$f":"'Savings Summary'!E3","v":0},null,{"$f":"'Savings Summary'!F3","v":0}]
[]
[]
[]
[]
["I acknowledge the above designated measure(s) were installed and performed to my satisfaction. I understand the contractor is an independent contractor who is solely responsible for work provided and will be receiving the incentive from the El Paso Electric Company (EPE). I acknowledge that EPE and CLEAResult make no warranty or representation of the qualifications or technical feasibility, capability, safety or reliability of the measure installed by the contractor. By signing below, I agree to give CLEAResult and/or EPE access to project site for inspections if necessary. Customer may contact EPE at (915) 351‐4268 in the event of non‐performance by contractor."]
[]
[]
[]
[]
["Printed Name",null,null,null,null,"Customer Signature",null,null,null,"Date"]
[]
[]
["Contractor",null,null,null,null,"Representative Signature",null,null,null,"Date"]
[]
[]
["CLEAResult Representative",null,null,null,null,"Representative Signature",null,null,null,"Date"]
[]
[]
["Contractor must submit Incentive Form, Photographs, Invoice and Income Eligibility Form (if applicable) within 45 days of completion to      epe‐portal.clearesult.com/contractor. "]

{"sheet":"Savings Summary","index":2,"n_rows":12,"n_cols":6,"rows_kept":12,"cut":false,"hidden":false,"merged":[]}
[null,"Savings Summary"]
[null,null,"Total Summer Peak kW Savings","Total Winter Peak kW Savings","Total kWh Savings","Total Incentive"]
[null,null,{"$f":"SUM(C6:C12)","v":0},0,0,{"$f":"SUM(F6:F12)","v":0}]
[]
[null,"Measure Name","Summer Peak kW Savings","Winter Peak kW Savings","kWh Savings","Incentive"]
[null,"HVAC - New Construction",{"$f":"SUMIF(HVAC!$B7:$B11,\"New Construction\",HVAC!P7:P11)","v":0},{"$f":"SUMIF(HVAC!$B7:$B11,\"New Construction\",HVAC!Q7:Q11)","v":0},{"$f":"SUMIF(HVAC!B7:B11,\"New Construction\",HVAC!O7:O11)","v":0},{"$f":"SUMIF(HVAC!B7:B11,\"New Construction\",HVAC!R7:R11)","v":0}]
[null,"HVAC - Replace On Burnout",{"$f":"SUMIF(HVAC!$B7:$B11,\"Replace On Burnout\",HVAC!P7:P11)","v":0},{"$f":"SUMIF(HVAC!$B7:$B11,\"Replace On Burnout\",HVAC!Q7:Q11)","v":0},{"$f":"SUMIF(HVAC!B7:B11,\"Replace On Burnout\",HVAC!O7:O11)","v":0},{"$f":"SUMIF(HVAC!B7:B11,\"Replace On Burnout\",HVAC!R7:R11)","v":0}]
[null,"HVAC - Early Retirement",{"$f":"SUMIF(HVAC!$B7:$B11,\"Early Retirement\",HVAC!P7:P11)","v":0},{"$f":"SUMIF(HVAC!$B7:$B11,\"Early Retirement\",HVAC!Q7:Q11)","v":0},{"$f":"SUMIF(HVAC!B7:B11,\"Early Retirement\",HVAC!O7:O11)","v":0},{"$f":"SUMIF(HVAC!B7:B11,\"Early Retirement\",HVAC!R7:R11)","v":0}]
[null,"Wall Insulation",{"$f":"IF(LEFT('Wall Insulation'!B13,1)=\"S\",'Wall Insulation'!C13,0)","v":0},{"$f":"IF(LEFT('Wall Insulation'!B13,1)=\"W\",'Wall Insulation'!C13,0)","v":0},{"$f":"'Wall Insulation'!C12","v":0},{"$f":"'Wall Insulation'!C14","v":0}]
[null,"Floor Insulation",{"$f":"IF(LEFT('Floor Insulation'!B11,1)=\"S\",'Floor Insulation'!C11,0)","v":0},{"$f":"IF(LEFT('Floor Insulation'!B11,1)=\"W\",'Floor Insulation'!C11,0)","v":0},{"$f":"'Floor Insulation'!C10","v":0},{"$f":"'Floor Insulation'!C12","v":0}]
[null,"Air Infiltration",{"$f":"IF(LEFT('Air Infiltration'!B12,1)=\"S\",'Air Infiltration'!C12,0)","v":0},{"$f":"IF(LEFT('Air Infiltration'!B12,1)=\"W\",'Air Infiltration'!C12,0)","v":0},{"$f":"'Air Infiltration'!C11","v":0},{"$f":"'Air Infiltration'!C13","v":0}]
[null,"Cool Roofs",{"$f":"IF(LEFT('Cool Roofs'!B14,1)=\"S\",'Cool Roofs'!C14,0)","v":0},{"$f":"IF(LEFT('Cool Roofs'!B14,1)=\"W\",'Cool Roofs'!C14,0)","v":0},{"$f":"'Cool Roofs'!C13","v":0},{"$f":"'Cool Roofs'!C15","v":0}]

{"sheet":"HVAC","index":3,"n_rows":11,"n_cols":75,"rows_kept":11,"cut":false,"hidden":true,"merged":[[4,71,4,74],[4,53,4,70],[4,19,4,31],[2,1,2,6],[4,32,4,38],[4,39,4,45],[4,46,4,52],[4,2,4,4],[4,5,4,12],[4,14,4,17],[4,1,5,1]]}
[null,null,null,null,null,null,null,null,null,null,null,null,null,null,null,null,null,null,null,"Hide","Hide","Hide","Hide","Hide","Hide","Hide","Hide","Hide","Hide","Hide","Hide","Hide","Hide","Hide","Hide","Hide","Hide","Hide","Hide","Hide","Hide","Hide","Hide","Hide","Hide","Hide","Hide","Hide","Hide","Hide","Hide","Hide","Hide","Hide","Hide","Hide","Hide","Hide","Hide","Hide","Hide","Hide","Hide","Hide","Hide","Hide","Hide","Hide","Hide","Hide","Hide","Hide","Hide","Hide","Hide"]
[]
[null,"HVAC & AC Mini Splits"]
[]
[null,"Project Type","Removed Equipment",null,null,"New Equipment",null,null,null,null,null,null,null,null,"Savings",null,null,null,null,"Equipment Lookups",null,null,null,null,null,null,null,null,null,null,null,null,"New Construction Savings (single unit)",null,null,null,null,null,null,"Replace-On-Burnout Savings (single unit)",null,null,null,null,null,null,"Early Replacement Savings (single unit)",null,null,null,null,null,null,"NPV ER calculations (single unit)",null,null,null,null,null,null,null,null,null,null,null,null,null,null,null,null,null,"Final Savings"]
[null,null,"Type\n(ER/ROB Only)","Size (BTUH)\n(ER/ROB Only)","Manufactured Year\n(ER Only)","Manufacturer/Model","AHRI Reference #","Equipment Type","Size (BTUH)","Full-Load (EER)","Part-Load (SEER)","Heating (HSPF)\nHeat Pump Only","Unit Quantity",null,"Annual Energy Savings\n[kWh]","Summer Demand Savings\n[kW]","Winter Demand Savings\n[kW]","Project Incentive",null,"Old Nom Tons","Old Btuh Range","New Nom Tons","BTUH Index","Btuh Range","SEER Index","SEER Range","HSPF Range","Size Change?","Base SEER (ER)","Type\n(HP)","Heating Baseline\n(HP)","Base HSPF (HP ER)","Cooling Index","Heating Index","kWh cool","kWh heat","kWh c+h","Summer kW","Winter kW","Cooling Index","Heating Index","kWh cool","kWh heat","kWh c+h","Summer kW","Winter kW","Cooling Index","Heating Index","kWh cool","kWh heat","kWh c+h","Summer kW","Winter kW","Equipment Age (yrs)","RUL","EUL (yrs)","YearsST","NPV kWs FT","NPV kWs ST","NPV kWw FT","NPV kWw ST","NPV kWh FT","NPV kWh ST","NPV kWs Total","NPV kWw Total","NPV kWh Total","NPV kWEUL","NPV kWhEUL","kWs Weighted","kWw Weighted","kWh Weighted","Peak Period","kW Summer","kW Winter","kWh"]
[1,null,null,null,null,null,null,null,null,null,null,null,null,null,{"$f":"IFERROR(M7*BW7,0)","v":0},{"$f":"IFERROR(IF(BT7=\"Summer\",M7*BU7,0),0)","v":0},{"$f":"IFERROR(IF(BT7=\"Winter\",M7*BV7,0),0)","v":0},{"$f":"IFERROR((P7+Q7)*Incentive_Rate,0)","v":0},null,{"$f":"INDEX('HVAC Lookups'!C$3:D$10,MATCH(HVAC!D7,'HVAC Lookups'!B$3:B$10,1),2)","v":1},{"$f":"INDEX('HVAC Lookups'!C$3:D$10,MATCH(HVAC!D7,'HVAC Lookups'!B$3:B$10,1),1)","v":"< 15,000"},{"$f":"INDEX('HVAC Lookups'!C$3:D$10,MATCH(HVAC!I7,'HVAC Lookups'!B$3:B$10,1),2)","v":1},{"$f":"MATCH(HVAC!I7,'HVAC Lookups'!B$3:B$10,1)","v":1},{"$f":"INDEX('HVAC Lookups'!C$3:D$10,W7,1)","v":"< 15,000"},{"$f":"MATCH(K7,'HVAC Lookups'!F$3:F$9,1)","v":{"$error":"#N/A"}},{"$f":"INDEX('HVAC Lookups'!G$3:G$9,HVAC!Y7)","v":{"$error":"#N/A"}},{"$f":"INDEX('HVAC Lookups'!J$3:J$10,MATCH(HVAC!L7,'HVAC Lookups'!I$3:I$10,1))","v":{"$error":"#N/A"}},{"$f":"IF(OR(D7=\"\",I7=\"\"),\"\",IF(V7>T7,\"Up\",IF(V7<T7,\"Down\",\"No\")))","v":""},{"$f":"IF(B7=\"Early Retirement\",INDEX('HVAC Lookups'!Q3:Q28,MATCH(E7,ManufYr,0)),\"\")","v":""},{"$f":"IF(H7=\"Central Heat Pump\",\"Central\",IF(H7=\"Mini Split Heat Pump\",\"Mini Split\",\"\"))","v":""},{"$f":"IF(OR(B7=\"New Construction\",AND(H7<>\"Central Heat Pump\",H7<>\"Mini Split Heat Pump\")),\"\",IF(C7=\"Central A/C with Electric Heat\",\"Electric Resistance\",\"Heat Pump\"))","v":""},{"$f":"IF(B7<>\"Early Retirement\",\"\",INDEX('HVAC Lookups'!R3:S28,MATCH(HVAC!E7,ManufYr,0),IF(HVAC!AE7=\"Heat Pump\",1,2)))","v":""},{"$f":"MATCH(X7,'Cooling NC'!A:A,0)","v":5},{"$f":"MATCH(1,(X7='Heating NC ROB'!C:C)*(HVAC!AA7='Heating NC ROB'!A:A)*(AD7='Heating NC ROB'!B:B),0)","v":{"$error":"#N/A"}},{"$f":"INDEX('Cooling NC'!B:H,HVAC!AG7,HVAC!Y7)","v":{"$error":"#N/A"}},{"$f":"INDEX('Heating NC ROB'!D:K,HVAC!AH7,HVAC!W7)","v":{"$error":"#N/A"}},{"$f":"AI7+AJ7","v":{"$error":"#N/A"}},{"$f":"INDEX('Cooling NC'!L:R,HVAC!AG7,HVAC!Y7)","v":{"$error":"#N/A"}},{"$f":"INDEX('Heating NC ROB'!O:V,HVAC!AH7,HVAC!W7)","v":{"$error":"#N/A"}},{"$f":"MATCH(1,(U7='Cooling ROB'!C:C)*(HVAC!Z7='Cooling ROB'!A:A),0)","v":{"$error":"#N/A"}},{"$f":"IF(AE7=\"Heat Pump\",MATCH(1,(AA7='Heating NC ROB'!A:A)*(HVAC!U7='Heating NC ROB'!C:C)*(AD7='Heating NC ROB'!B:B),0),\nIF(AE7=\"Electric Resistance\",MATCH(1,(HVAC!AA7='Heating Resistance'!A:A)*(HVAC!AD7='Heating Resistance'!B:B)*(HVAC!U7='Heating Resistance'!C:C),0),\"\"))","v":""},{"$f":"INDEX('Cooling ROB'!D:K,HVAC!AN7,HVAC!W7)","v":{"$error":"#N/A"}},{"$f":"IFERROR(INDEX(IF(AE7=\"Heat Pump\",'Heating NC ROB'!D:K,'Heating Resistance'!D:K),HVAC!AO7,HVAC!W7),0)","v":0},{"$f":"AP7+AQ7","v":{"$error":"#N/A"}},{"$f":"INDEX('Cooling ROB'!O:V,HVAC!AN7,HVAC!W7)","v":{"$error":"#N/A"}},{"$f":"IFERROR(INDEX(IF(AE7=\"Heat Pump\",'Heating NC ROB'!O:V,'Heating Resistance'!O:V),HVAC!AO7,HVAC!W7),0)","v":0},{"$f":"MATCH(1,(U7='Cooling ER'!C:C)*(HVAC!AC7='Cooling ER'!A:A)*(HVAC!Z7='Cooling ER'!B:B),0)","v":{"$error":"#N/A"}},{"$f":"IF(AE7=\"Heat Pump\",MATCH(1,(HVAC!AF7='Heating ER'!A:A)*(HVAC!AA7='Heating ER'!B:B)*(HVAC!U7='Heating ER'!D:D)*(AD7='Heating ER'!C:C),0),IF(AE7=\"Electric Resistance\",AO7,\"\"))","v":""},{"$f":"INDEX('Cooling ER'!D:K,HVAC!AU7,HVAC!W7)","v":{"$error":"#N/A"}},{"$f":"IFERROR(IF(AE7=\"Electric Resistance\",AQ7,IF(AE7=\"Heat Pump\",INDEX('Heating ER'!E:L,HVAC!AV7,HVAC!W7),0)),0)","v":0},{"$f":"AW7+AX7","v":{"$error":"#N/A"}},{"$f":"INDEX('Cooling ER'!O:V,HVAC!AU7,HVAC!W7)","v":{"$error":"#N/A"}},{"$f":"IFERROR(IF(AE7=\"Electric Resistance\",AT7,IF(AE7=\"Heat Pump\",INDEX('Heating ER'!P:W,HVAC!AV7,HVAC!W7),0)),0)","v":0},{"$f":"INDEX(Age,MATCH(E7,ManufYr,0))","v":{"$error":"#N/A"}},{"$f":"INDEX(IFERROR(IF(SEARCH(\"A/C\",C7)>0,ACRUL),HPRUL),MATCH(E7,ManufYr,0))","v":{"$error":"#N/A"}},{"$f":"IFERROR(IF(SEARCH(\"A/C\",C7)>0,18),15)","v":15},{"$f":"BD7-BC7","v":{"$error":"#N/A"}},{"$f":" ACkW * (1+escalation)/(discount-escalation) * (1 - ((1+escalation)/(1+discount))^BC7) * AZ7","v":{"$error":"#N/A"}},{"$f":" ACkW * (1+escalation)/(discount-escalation) * (1 - ((1+escalation)/(1+discount))^BE7) * (1+escalation)^BC7/(1+discount)^BC7* AS7","v":{"$error":"#N/A"}},{"$f":" ACkW * (1+escalation)/(discount-escalation) * (1 - ((1+escalation)/(1+discount))^BC7) * BA7","v":{"$error":"#N/A"}},{"$f":" ACkW * (1+escalation)/(discount-escalation) * (1 - ((1+escalation)/(1+discount))^BE7) * (1+escalation)^BC7/(1+discount)^BC7* AT7","v":{"$error":"#N/A"}},{"$f":" ACkWh * (1+escalation)/(discount-escalation) * (1 - ((1+escalation)/(1+discount))^BC7) * AY7","v":{"$error":"#N/A"}},{"$f":" ACkWh * (1+escalation)/(discount-escalation) * (1 - ((1+escalation)/(1+discount))^BE7) * (1+escalation)^BC7/(1+discount)^BC7* AR7","v":{"$error":"#N/A"}},{"$f":"BF7+BG7","v":{"$error":"#N/A"}},{"$f":"BH7+BI7","v":{"$error":"#N/A"}},{"$f":"BJ7+BK7","v":{"$error":"#N/A"}},{"$f":" ACkW * (1+escalation)/(discount-escalation) * (1 - ((1+escalation)/(1+discount))^BD7)","v":834.51513283847316},{"$f":" ACkWh * (1+escalation)/(discount-escalation) * (1 - ((1+escalation)/(1+discount))^BD7)","v":1.0599385330964657},{"$f":"BL7/BO7","v":{"$error":"#N/A"}},{"$f":"BM7/BO7","v":{"$error":"#N/A"}},{"$f":"BN7/BP7","v":{"$error":"#N/A"}},{"$f":"IF(BU7<BV7,\"Winter\",\"Summer\")","v":"Summer"},{"$f":"IF($B7=\"New Construction\",AL7,IF($B7=\"Replace On Burnout\",AS7,IF($B7=\"Early Retirement\",BQ7,0)))","v":0},{"$f":"IF($B7=\"New Construction\",AM7,IF($B7=\"Replace On Burnout\",AT7,IF($B7=\"Early Retirement\",BR7,0)))","v":0},{"$f":"IF(B7=\"New Construction\",AK7,IF(B7=\"Replace On Burnout\",AR7,IF(B7=\"Early Retirement\",BN7/BP7,0)))","v":0}]
[2,null,null,null,null,null,null,null,null,null,null,null,null,null,{"$f":"IFERROR(M8*BW8,0)","v":0},{"$f":"IFERROR(IF(BT8=\"Summer\",M8*BU8,0),0)","v":0},{"$f":"IFERROR(IF(BT8=\"Winter\",M8*BV8,0),0)","v":0},{"$f":"IFERROR((P8+Q8)*Incentive_Rate,0)","v":0},null,{"$f":"INDEX('HVAC Lookups'!C$3:D$10,MATCH(HVAC!D8,'HVAC Lookups'!B$3:B$10,1),2)","v":1},{"$f":"INDEX('HVAC Lookups'!C$3:D$10,MATCH(HVAC!D8,'HVAC Lookups'!B$3:B$10,1),1)","v":"< 15,000"},{"$f":"INDEX('HVAC Lookups'!C$3:D$10,MATCH(HVAC!I8,'HVAC Lookups'!B$3:B$10,1),2)","v":1},{"$f":"MATCH(HVAC!I8,'HVAC Lookups'!B$3:B$10,1)","v":1},{"$f":"INDEX('HVAC Lookups'!C$3:D$10,W8,1)","v":"< 15,000"},{"$f":"MATCH(K8,'HVAC Lookups'!F$3:F$9,1)","v":{"$error":"#N/A"}},{"$f":"INDEX('HVAC Lookups'!G$3:G$9,HVAC!Y8)","v":{"$error":"#N/A"}},{"$f":"INDEX('HVAC Lookups'!J$3:J$10,MATCH(HVAC!L8,'HVAC Lookups'!I$3:I$10,1))","v":{"$error":"#N/A"}},{"$f":"IF(OR(D8=\"\",I8=\"\"),\"\",IF(V8>T8,\"Up\",IF(V8<T8,\"Down\",\"No\")))","v":""},{"$f":"IF(B8=\"Early Retirement\",INDEX('HVAC Lookups'!Q4:Q29,MATCH(E8,ManufYr,0)),\"\")","v":""},{"$f":"IF(H8=\"Central Heat Pump\",\"Central\",IF(H8=\"Mini Split Heat Pump\",\"Mini Split\",\"\"))","v":""},{"$f":"IF(OR(B8=\"New Construction\",AND(H8<>\"Central Heat Pump\",H8<>\"Mini Split Heat Pump\")),\"\",IF(C8=\"Central A/C with Electric Heat\",\"Electric Resistance\",\"Heat Pump\"))","v":""},{"$f":"IF(B8<>\"Early Retirement\",\"\",INDEX('HVAC Lookups'!R4:S29,MATCH(HVAC!E8,ManufYr,0),IF(HVAC!AE8=\"Heat Pump\",1,2)))","v":""},{"$f":"MATCH(X8,'Cooling NC'!A:A,0)","v":5},{"$f":"MATCH(1,(X8='Heating NC ROB'!C:C)*(HVAC!AA8='Heating NC ROB'!A:A)*(AD8='Heating NC ROB'!B:B),0)","v":{"$error":"#N/A"}},{"$f":"INDEX('Cooling NC'!B:H,HVAC!AG8,HVAC!Y8)","v":{"$error":"#N/A"}},{"$f":"INDEX('Heating NC ROB'!D:K,HVAC!AH8,HVAC!W8)","v":{"$error":"#N/A"}},{"$f":"AI8+AJ8","v":{"$error":"#N/A"}},{"$f":"INDEX('Cooling NC'!L:R,HVAC!AG8,HVAC!Y8)","v":{"$error":"#N/A"}},{"$f":"INDEX('Heating NC ROB'!O:V,HVAC!AH8,HVAC!W8)","v":{"$error":"#N/A"}},{"$f":"MATCH(1,(U8='Cooling ROB'!C:C)*(HVAC!Z8='Cooling ROB'!A:A),0)","v":{"$error":"#N/A"}},{"$f":"IF(AE8=\"Heat Pump\",MATCH(1,(AA8='Heating NC ROB'!A:A)*(HVAC!U8='Heating NC ROB'!C:C)*(AD8='Heating NC ROB'!B:B),0),\nIF(AE8=\"Electric Resistance\",MATCH(1,(HVAC!AA8='Heating Resistance'!A:A)*(HVAC!AD8='Heating Resistance'!B:B)*(HVAC!U8='Heating Resistance'!C:C),0),\"\"))","v":""},{"$f":"INDEX('Cooling ROB'!D:K,HVAC!AN8,HVAC!W8)","v":{"$error":"#N/A"}},{"$f":"IFERROR(INDEX(IF(AE8=\"Heat Pump\",'Heating NC ROB'!D:K,'Heating Resistance'!D:K),HVAC!AO8,HVAC!W8),0)","v":0},{"$f":"AP8+AQ8","v":{"$error":"#N/A"}},{"$f":"INDEX('Cooling ROB'!O:V,HVAC!AN8,HVAC!W8)","v":{"$error":"#N/A"}},{"$f":"IFERROR(INDEX(IF(AE8=\"Heat Pump\",'Heating NC ROB'!O:V,'Heating Resistance'!O:V),HVAC!AO8,HVAC!W8),0)","v":0},{"$f":"MATCH(1,(U8='Cooling ER'!C:C)*(HVAC!AC8='Cooling ER'!A:A)*(HVAC!Z8='Cooling ER'!B:B),0)","v":{"$error":"#N/A"}},{"$f":"IF(AE8=\"Heat Pump\",MATCH(1,(HVAC!AF8='Heating ER'!A:A)*(HVAC!AA8='Heating ER'!B:B)*(HVAC!U8='Heating ER'!D:D)*(AD8='Heating ER'!C:C),0),IF(AE8=\"Electric Resistance\",AO8,\"\"))","v":""},{"$f":"INDEX('Cooling ER'!D:K,HVAC!AU8,HVAC!W8)","v":{"$error":"#N/A"}},{"$f":"IFERROR(IF(AE8=\"Electric Resistance\",AQ8,IF(AE8=\"Heat Pump\",INDEX('Heating ER'!E:L,HVAC!AV8,HVAC!W8),0)),0)","v":0},{"$f":"AW8+AX8","v":{"$error":"#N/A"}},{"$f":"INDEX('Cooling ER'!O:V,HVAC!AU8,HVAC!W8)","v":{"$error":"#N/A"}},{"$f":"IFERROR(IF(AE8=\"Electric Resistance\",AT8,IF(AE8=\"Heat Pump\",INDEX('Heating ER'!P:W,HVAC!AV8,HVAC!W8),0)),0)","v":0},{"$f":"INDEX(Age,MATCH(E8,ManufYr,0))","v":{"$error":"#N/A"}},{"$f":"INDEX(IFERROR(IF(SEARCH(\"A/C\",C8)>0,ACRUL),HPRUL),MATCH(E8,ManufYr,0))","v":{"$error":"#N/A"}},{"$f":"IFERROR(IF(SEARCH(\"A/C\",C8)>0,18),15)","v":15},{"$f":"BD8-BC8","v":{"$error":"#N/A"}},{"$f":" ACkW * (1+escalation)/(discount-escalation) * (1 - ((1+escalation)/(1+discount))^BC8) * AZ8","v":{"$error":"#N/A"}},{"$f":" ACkW * (1+escalation)/(discount-escalation) * (1 - ((1+escalation)/(1+discount))^BE8) * (1+escalation)^BC8/(1+discount)^BC8* AS8","v":{"$error":"#N/A"}},{"$f":" ACkW * (1+escalation)/(discount-escalation) * (1 - ((1+escalation)/(1+discount))^BC8) * BA8","v":{"$error":"#N/A"}},{"$f":" ACkW * (1+escalation)/(discount-escalation) * (1 - ((1+escalation)/(1+discount))^BE8) * (1+escalation)^BC8/(1+discount)^BC8* AT8","v":{"$error":"#N/A"}},{"$f":" ACkWh * (1+escalation)/(discount-escalation) * (1 - ((1+escalation)/(1+discount))^BC8) * AY8","v":{"$error":"#N/A"}},{"$f":" ACkWh * (1+escalation)/(discount-escalation) * (1 - ((1+escalation)/(1+discount))^BE8) * (1+escalation)^BC8/(1+discount)^BC8* AR8","v":{"$error":"#N/A"}},{"$f":"BF8+BG8","v":{"$error":"#N/A"}},{"$f":"BH8+BI8","v":{"$error":"#N/A"}},{"$f":"BJ8+BK8","v":{"$error":"#N/A"}},{"$f":" ACkW * (1+escalation)/(discount-escalation) * (1 - ((1+escalation)/(1+discount))^BD8)","v":834.51513283847316},{"$f":" ACkWh * (1+escalation)/(discount-escalation) * (1 - ((1+escalation)/(1+discount))^BD8)","v":1.0599385330964657},{"$f":"BL8/BO8","v":{"$error":"#N/A"}},{"$f":"BM8/BO8","v":{"$error":"#N/A"}},{"$f":"BN8/BP8","v":{"$error":"#N/A"}},{"$f":"IF(BU8<BV8,\"Winter\",\"Summer\")","v":"Summer"},{"$f":"IF(B8=\"New Construction\",AL8,IF(B8=\"Replace On Burnout\",AS8,IF(B8=\"Early Retirement\",BL8/BO8,0)))","v":0},{"$f":"IF($B8=\"New Construction\",AM8,IF($B8=\"Replace On Burnout\",AT8,IF($B8=\"Early Retirement\",BR8,0)))","v":0},{"$f":"IF(B8=\"New Construction\",AK8,IF(B8=\"Replace On Burnout\",AR8,IF(B8=\"Early Retirement\",BN8/BP8,0)))","v":0}]
[3,null,null,null,null,null,null,null,null,null,null,null,null,null,{"$f":"IFERROR(M9*BW9,0)","v":0},0,0,{"$f":"IFERROR((P9+Q9)*Incentive_Rate,0)","v":0},null,{"$f":"INDEX('HVAC Lookups'!C$3:D$10,MATCH(HVAC!D9,'HVAC Lookups'!B$3:B$10,1),2)","v":1},{"$f":"INDEX('HVAC Lookups'!C$3:D$10,MATCH(HVAC!D9,'HVAC Lookups'!B$3:B$10,1),1)","v":"< 15,000"},{"$f":"INDEX('HVAC Lookups'!C$3:D$10,MATCH(HVAC!I9,'HVAC Lookups'!B$3:B$10,1),2)","v":1},{"$f":"MATCH(HVAC!I9,'HVAC Lookups'!B$3:B$10,1)","v":1},{"$f":"INDEX('HVAC Lookups'!C$3:D$10,W9,1)","v":"< 15,000"},{"$f":"MATCH(K9,'HVAC Lookups'!F$3:F$9,1)","v":{"$error":"#N/A"}},{"$f":"INDEX('HVAC Lookups'!G$3:G$9,HVAC!Y9)","v":{"$error":"#N/A"}},{"$f":"INDEX('HVAC Lookups'!J$3:J$10,MATCH(HVAC!L9,'HVAC Lookups'!I$3:I$10,1))","v":{"$error":"#N/A"}},"",{"$f":"IF(B9=\"Early Retirement\",INDEX('HVAC Lookups'!Q5:Q30,MATCH(E9,ManufYr,0)),\"\")","v":""},"","",{"$f":"IF(B9<>\"Early Retirement\",\"\",INDEX('HVAC Lookups'!R5:S30,MATCH(HVAC!E9,ManufYr,0),IF(HVAC!AE9=\"Heat Pump\",1,2)))","v":""},{"$f":"MATCH(X9,'Cooling NC'!A:A,0)","v":5},{"$f":"MATCH(1,(X9='Heating NC ROB'!C:C)*(HVAC!AA9='Heating NC ROB'!A:A)*(AD9='Heating NC ROB'!B:B),0)","v":{"$error":"#N/A"}},{"$f":"INDEX('Cooling NC'!B:H,HVAC!AG9,HVAC!Y9)","v":{"$error":"#N/A"}},{"$f":"INDEX('Heating NC ROB'!D:K,HVAC!AH9,HVAC!W9)","v":{"$error":"#N/A"}},{"$error":"#N/A"},{"$f":"INDEX('Cooling NC'!L:R,HVAC!AG9,HVAC!Y9)","v":{"$error":"#N/A"}},{"$f":"INDEX('Heating NC ROB'!O:V,HVAC!AH9,HVAC!W9)","v":{"$error":"#N/A"}},{"$f":"MATCH(1,(U9='Cooling ROB'!C:C)*(HVAC!Z9='Cooling ROB'!A:A),0)","v":{"$error":"#N/A"}},{"$f":"IF(AE9=\"Heat Pump\",MATCH(1,(AA9='Heating NC ROB'!A:A)*(HVAC!U9='Heating NC ROB'!C:C)*(AD9='Heating NC ROB'!B:B),0),\nIF(AE9=\"Electric Resistance\",MATCH(1,(HVAC!AA9='Heating Resistance'!A:A)*(HVAC!AD9='Heating Resistance'!B:B)*(HVAC!U9='Heating Resistance'!C:C),0),\"\"))","v":""},{"$f":"INDEX('Cooling ROB'!D:K,HVAC!AN9,HVAC!W9)","v":{"$error":"#N/A"}},{"$f":"IFERROR(INDEX(IF(AE9=\"Heat Pump\",'Heating NC ROB'!D:K,'Heating Resistance'!D:K),HVAC!AO9,HVAC!W9),0)","v":0},{"$error":"#N/A"},{"$f":"INDEX('Cooling ROB'!O:V,HVAC!AN9,HVAC!W9)","v":{"$error":"#N/A"}},{"$f":"IFERROR(INDEX(IF(AE9=\"Heat Pump\",'Heating NC ROB'!O:V,'Heating Resistance'!O:V),HVAC!AO9,HVAC!W9),0)","v":0},{"$f":"MATCH(1,(U9='Cooling ER'!C:C)*(HVAC!AC9='Cooling ER'!A:A)*(HVAC!Z9='Cooling ER'!B:B),0)","v":{"$error":"#N/A"}},{"$f":"IF(AE9=\"Heat Pump\",MATCH(1,(HVAC!AF9='Heating ER'!A:A)*(HVAC!AA9='Heating ER'!B:B)*(HVAC!U9='Heating ER'!D:D)*(AD9='Heating ER'!C:C),0),IF(AE9=\"Electric Resistance\",AO9,\"\"))","v":""},{"$f":"INDEX('Cooling ER'!D:K,HVAC!AU9,HVAC!W9)","v":{"$error":"#N/A"}},{"$f":"IFERROR(IF(AE9=\"Electric Resistance\",AQ9,IF(AE9=\"Heat Pump\",INDEX('Heating ER'!E:L,HVAC!AV9,HVAC!W9),0)),0)","v":0},{"$error":"#N/A"},{"$f":"INDEX('Cooling ER'!O:V,HVAC!AU9,HVAC!W9)","v":{"$error":"#N/A"}},{"$f":"IFERROR(IF(AE9=\"Electric Resistance\",AT9,IF(AE9=\"Heat Pump\",INDEX('Heating ER'!P:W,HVAC!AV9,HVAC!W9),0)),0)","v":0},{"$f":"INDEX(Age,MATCH(E9,ManufYr,0))","v":{"$error":"#N/A"}},{"$f":"INDEX(IFERROR(IF(SEARCH(\"A/C\",C9)>0,ACRUL),HPRUL),MATCH(E9,ManufYr,0))","v":{"$error":"#N/A"}},15,{"$error":"#N/A"},{"$f":" ACkW * (1+escalation)/(discount-escalation) * (1 - ((1+escalation)/(1+discount))^BC9) * AZ9","v":{"$error":"#N/A"}},{"$f":" ACkW * (1+escalation)/(discount-escalation) * (1 - ((1+escalation)/(1+discount))^BE9) * (1+escalation)^BC9/(1+discount)^BC9* AS9","v":{"$error":"#N/A"}},{"$f":" ACkW * (1+escalation)/(discount-escalation) * (1 - ((1+escalation)/(1+discount))^BC9) * BA9","v":{"$error":"#N/A"}},{"$f":" ACkW * (1+escalation)/(discount-escalation) * (1 - ((1+escalation)/(1+discount))^BE9) * (1+escalation)^BC9/(1+discount)^BC9* AT9","v":{"$error":"#N/A"}},{"$f":" ACkWh * (1+escalation)/(discount-escalation) * (1 - ((1+escalation)/(1+discount))^BC9) * AY9","v":{"$error":"#N/A"}},{"$f":" ACkWh * (1+escalation)/(discount-escalation) * (1 - ((1+escalation)/(1+discount))^BE9) * (1+escalation)^BC9/(1+discount)^BC9* AR9","v":{"$error":"#N/A"}},{"$error":"#N/A"},{"$error":"#N/A"},{"$error":"#N/A"},{"$f":" ACkW * (1+escalation)/(discount-escalation) * (1 - ((1+escalation)/(1+discount))^BD9)","v":834.51513283847316},{"$f":" ACkWh * (1+escalation)/(discount-escalation) * (1 - ((1+escalation)/(1+discount))^BD9)","v":1.0599385330964657},{"$error":"#N/A"},{"$error":"#N/A"},{"$error":"#N/A"},"Summer",0,0,0]
[4,null,null,null,null,null,null,null,null,null,null,null,null,null,{"$f":"IFERROR(M10*BW10,0)","v":0},0,0,{"$f":"IFERROR((P10+Q10)*Incentive_Rate,0)","v":0},null,{"$f":"INDEX('HVAC Lookups'!C$3:D$10,MATCH(HVAC!D10,'HVAC Lookups'!B$3:B$10,1),2)","v":1},{"$f":"INDEX('HVAC Lookups'!C$3:D$10,MATCH(HVAC!D10,'HVAC Lookups'!B$3:B$10,1),1)","v":"< 15,000"},{"$f":"INDEX('HVAC Lookups'!C$3:D$10,MATCH(HVAC!I10,'HVAC Lookups'!B$3:B$10,1),2)","v":1},{"$f":"MATCH(HVAC!I10,'HVAC Lookups'!B$3:B$10,1)","v":1},{"$f":"INDEX('HVAC Lookups'!C$3:D$10,W10,1)","v":"< 15,000"},{"$f":"MATCH(K10,'HVAC Lookups'!F$3:F$9,1)","v":{"$error":"#N/A"}},{"$f":"INDEX('HVAC Lookups'!G$3:G$9,HVAC!Y10)","v":{"$error":"#N/A"}},{"$f":"INDEX('HVAC Lookups'!J$3:J$10,MATCH(HVAC!L10,'HVAC Lookups'!I$3:I$10,1))","v":{"$error":"#N/A"}},"",{"$f":"IF(B10=\"Early Retirement\",INDEX('HVAC Lookups'!Q6:Q31,MATCH(E10,ManufYr,0)),\"\")","v":""},"","",{"$f":"IF(B10<>\"Early Retirement\",\"\",INDEX('HVAC Lookups'!R6:S31,MATCH(HVAC!E10,ManufYr,0),IF(HVAC!AE10=\"Heat Pump\",1,2)))","v":""},{"$f":"MATCH(X10,'Cooling NC'!A:A,0)","v":5},{"$f":"MATCH(1,(X10='Heating NC ROB'!C:C)*(HVAC!AA10='Heating NC ROB'!A:A)*(AD10='Heating NC ROB'!B:B),0)","v":{"$error":"#N/A"}},{"$f":"INDEX('Cooling NC'!B:H,HVAC!AG10,HVAC!Y10)","v":{"$error":"#N/A"}},{"$f":"INDEX('Heating NC ROB'!D:K,HVAC!AH10,HVAC!W10)","v":{"$error":"#N/A"}},{"$error":"#N/A"},{"$f":"INDEX('Cooling NC'!L:R,HVAC!AG10,HVAC!Y10)","v":{"$error":"#N/A"}},{"$f":"INDEX('Heating NC ROB'!O:V,HVAC!AH10,HVAC!W10)","v":{"$error":"#N/A"}},{"$f":"MATCH(1,(U10='Cooling ROB'!C:C)*(HVAC!Z10='Cooling ROB'!A:A),0)","v":{"$error":"#N/A"}},{"$f":"IF(AE10=\"Heat Pump\",MATCH(1,(AA10='Heating NC ROB'!A:A)*(HVAC!U10='Heating NC ROB'!C:C)*(AD10='Heating NC ROB'!B:B),0),\nIF(AE10=\"Electric Resistance\",MATCH(1,(HVAC!AA10='Heating Resistance'!A:A)*(HVAC!AD10='Heating Resistance'!B:B)*(HVAC!U10='Heating Resistance'!C:C),0),\"\"))","v":""},{"$f":"INDEX('Cooling ROB'!D:K,HVAC!AN10,HVAC!W10)","v":{"$error":"#N/A"}},{"$f":"IFERROR(INDEX(IF(AE10=\"Heat Pump\",'Heating NC ROB'!D:K,'Heating Resistance'!D:K),HVAC!AO10,HVAC!W10),0)","v":0},{"$error":"#N/A"},{"$f":"INDEX('Cooling ROB'!O:V,HVAC!AN10,HVAC!W10)","v":{"$error":"#N/A"}},{"$f":"IFERROR(INDEX(IF(AE10=\"Heat Pump\",'Heating NC ROB'!O:V,'Heating Resistance'!O:V),HVAC!AO10,HVAC!W10),0)","v":0},{"$f":"MATCH(1,(U10='Cooling ER'!C:C)*(HVAC!AC10='Cooling ER'!A:A)*(HVAC!Z10='Cooling ER'!B:B),0)","v":{"$error":"#N/A"}},{"$f":"IF(AE10=\"Heat Pump\",MATCH(1,(HVAC!AF10='Heating ER'!A:A)*(HVAC!AA10='Heating ER'!B:B)*(HVAC!U10='Heating ER'!D:D)*(AD10='Heating ER'!C:C),0),IF(AE10=\"Electric Resistance\",AO10,\"\"))","v":""},{"$f":"INDEX('Cooling ER'!D:K,HVAC!AU10,HVAC!W10)","v":{"$error":"#N/A"}},{"$f":"IFERROR(IF(AE10=\"Electric Resistance\",AQ10,IF(AE10=\"Heat Pump\",INDEX('Heating ER'!E:L,HVAC!AV10,HVAC!W10),0)),0)","v":0},{"$error":"#N/A"},{"$f":"INDEX('Cooling ER'!O:V,HVAC!AU10,HVAC!W10)","v":{"$error":"#N/A"}},{"$f":"IFERROR(IF(AE10=\"Electric Resistance\",AT10,IF(AE10=\"Heat Pump\",INDEX('Heating ER'!P:W,HVAC!AV10,HVAC!W10),0)),0)","v":0},{"$f":"INDEX(Age,MATCH(E10,ManufYr,0))","v":{"$error":"#N/A"}},{"$f":"INDEX(IFERROR(IF(SEARCH(\"A/C\",C10)>0,ACRUL),HPRUL),MATCH(E10,ManufYr,0))","v":{"$error":"#N/A"}},15,{"$error":"#N/A"},{"$f":" ACkW * (1+escalation)/(discount-escalation) * (1 - ((1+escalation)/(1+discount))^BC10) * AZ10","v":{"$error":"#N/A"}},{"$f":" ACkW * (1+escalation)/(discount-escalation) * (1 - ((1+escalation)/(1+discount))^BE10) * (1+escalation)^BC10/(1+discount)^BC10* AS10","v":{"$error":"#N/A"}},{"$f":" ACkW * (1+escalation)/(discount-escalation) * (1 - ((1+escalation)/(1+discount))^BC10) * BA10","v":{"$error":"#N/A"}},{"$f":" ACkW * (1+escalation)/(discount-escalation) * (1 - ((1+escalation)/(1+discount))^BE10) * (1+escalation)^BC10/(1+discount)^BC10* AT10","v":{"$error":"#N/A"}},{"$f":" ACkWh * (1+escalation)/(discount-escalation) * (1 - ((1+escalation)/(1+discount))^BC10) * AY10","v":{"$error":"#N/A"}},{"$f":" ACkWh * (1+escalation)/(discount-escalation) * (1 - ((1+escalation)/(1+discount))^BE10) * (1+escalation)^BC10/(1+discount)^BC10* AR10","v":{"$error":"#N/A"}},{"$error":"#N/A"},{"$error":"#N/A"},{"$error":"#N/A"},{"$f":" ACkW * (1+escalation)/(discount-escalation) * (1 - ((1+escalation)/(1+discount))^BD10)","v":834.51513283847316},{"$f":" ACkWh * (1+escalation)/(discount-escalation) * (1 - ((1+escalation)/(1+discount))^BD10)","v":1.0599385330964657},{"$error":"#N/A"},{"$error":"#N/A"},{"$error":"#N/A"},"Summer",0,0,0]
[5,null,null,null,null,null,null,null,null,null,null,null,null,null,{"$f":"IFERROR(M11*BW11,0)","v":0},0,0,{"$f":"IFERROR((P11+Q11)*Incentive_Rate,0)","v":0},null,{"$f":"INDEX('HVAC Lookups'!C$3:D$10,MATCH(HVAC!D11,'HVAC Lookups'!B$3:B$10,1),2)","v":1},{"$f":"INDEX('HVAC Lookups'!C$3:D$10,MATCH(HVAC!D11,'HVAC Lookups'!B$3:B$10,1),1)","v":"< 15,000"},{"$f":"INDEX('HVAC Lookups'!C$3:D$10,MATCH(HVAC!I11,'HVAC Lookups'!B$3:B$10,1),2)","v":1},{"$f":"MATCH(HVAC!I11,'HVAC Lookups'!B$3:B$10,1)","v":1},{"$f":"INDEX('HVAC Lookups'!C$3:D$10,W11,1)","v":"< 15,000"},{"$f":"MATCH(K11,'HVAC Lookups'!F$3:F$9,1)","v":{"$error":"#N/A"}},{"$f":"INDEX('HVAC Lookups'!G$3:G$9,HVAC!Y11)","v":{"$error":"#N/A"}},{"$f":"INDEX('HVAC Lookups'!J$3:J$10,MATCH(HVAC!L11,'HVAC Lookups'!I$3:I$10,1))","v":{"$error":"#N/A"}},"",{"$f":"IF(B11=\"Early Retirement\",INDEX('HVAC Lookups'!Q7:Q32,MATCH(E11,ManufYr,0)),\"\")","v":""},"","",{"$f":"IF(B11<>\"Early Retirement\",\"\",INDEX('HVAC Lookups'!R7:S32,MATCH(HVAC!E11,ManufYr,0),IF(HVAC!AE11=\"Heat Pump\",1,2)))","v":""},{"$f":"MATCH(X11,'Cooling NC'!A:A,0)","v":5},{"$f":"MATCH(1,(X11='Heating NC ROB'!C:C)*(HVAC!AA11='Heating NC ROB'!A:A)*(AD11='Heating NC ROB'!B:B),0)","v":{"$error":"#N/A"}},{"$f":"INDEX('Cooling NC'!B:H,HVAC!AG11,HVAC!Y11)","v":{"$error":"#N/A"}},{"$f":"INDEX('Heating NC ROB'!D:K,HVAC!AH11,HVAC!W11)","v":{"$error":"#N/A"}},{"$error":"#N/A"},{"$f":"INDEX('Cooling NC'!L:R,HVAC!AG11,HVAC!Y11)","v":{"$error":"#N/A"}},{"$f":"INDEX('Heating NC ROB'!O:V,HVAC!AH11,HVAC!W11)","v":{"$error":"#N/A"}},{"$f":"MATCH(1,(U11='Cooling ROB'!C:C)*(HVAC!Z11='Cooling ROB'!A:A),0)","v":{"$error":"#N/A"}},{"$f":"IF(AE11=\"Heat Pump\",MATCH(1,(AA11='Heating NC ROB'!A:A)*(HVAC!U11='Heating NC ROB'!C:C)*(AD11='Heating NC ROB'!B:B),0),\nIF(AE11=\"Electric Resistance\",MATCH(1,(HVAC!AA11='Heating Resistance'!A:A)*(HVAC!AD11='Heating Resistance'!B:B)*(HVAC!U11='Heating Resistance'!C:C),0),\"\"))","v":""},{"$f":"INDEX('Cooling ROB'!D:K,HVAC!AN11,HVAC!W11)","v":{"$error":"#N/A"}},{"$f":"IFERROR(INDEX(IF(AE11=\"Heat Pump\",'Heating NC ROB'!D:K,'Heating Resistance'!D:K),HVAC!AO11,HVAC!W11),0)","v":0},{"$error":"#N/A"},{"$f":"INDEX('Cooling ROB'!O:V,HVAC!AN11,HVAC!W11)","v":{"$error":"#N/A"}},{"$f":"IFERROR(INDEX(IF(AE11=\"Heat Pump\",'Heating NC ROB'!O:V,'Heating Resistance'!O:V),HVAC!AO11,HVAC!W11),0)","v":0},{"$f":"MATCH(1,(U11='Cooling ER'!C:C)*(HVAC!AC11='Cooling ER'!A:A)*(HVAC!Z11='Cooling ER'!B:B),0)","v":{"$error":"#N/A"}},{"$f":"IF(AE11=\"Heat Pump\",MATCH(1,(HVAC!AF11='Heating ER'!A:A)*(HVAC!AA11='Heating ER'!B:B)*(HVAC!U11='Heating ER'!D:D)*(AD11='Heating ER'!C:C),0),IF(AE11=\"Electric Resistance\",AO11,\"\"))","v":""},{"$f":"INDEX('Cooling ER'!D:K,HVAC!AU11,HVAC!W11)","v":{"$error":"#N/A"}},{"$f":"IFERROR(IF(AE11=\"Electric Resistance\",AQ11,IF(AE11=\"Heat Pump\",INDEX('Heating ER'!E:L,HVAC!AV11,HVAC!W11),0)),0)","v":0},{"$error":"#N/A"},{"$f":"INDEX('Cooling ER'!O:V,HVAC!AU11,HVAC!W11)","v":{"$error":"#N/A"}},{"$f":"IFERROR(IF(AE11=\"Electric Resistance\",AT11,IF(AE11=\"Heat Pump\",INDEX('Heating ER'!P:W,HVAC!AV11,HVAC!W11),0)),0)","v":0},{"$f":"INDEX(Age,MATCH(E11,ManufYr,0))","v":{"$error":"#N/A"}},{"$f":"INDEX(IFERROR(IF(SEARCH(\"A/C\",C11)>0,ACRUL),HPRUL),MATCH(E11,ManufYr,0))","v":{"$error":"#N/A"}},15,{"$error":"#N/A"},{"$f":" ACkW * (1+escalation)/(discount-escalation) * (1 - ((1+escalation)/(1+discount))^BC11) * AZ11","v":{"$error":"#N/A"}},{"$f":" ACkW * (1+escalation)/(discount-escalation) * (1 - ((1+escalation)/(1+discount))^BE11) * (1+escalation)^BC11/(1+discount)^BC11* AS11","v":{"$error":"#N/A"}},{"$f":" ACkW * (1+escalation)/(discount-escalation) * (1 - ((1+escalation)/(1+discount))^BC11) * BA11","v":{"$error":"#N/A"}},{"$f":" ACkW * (1+escalation)/(discount-escalation) * (1 - ((1+escalation)/(1+discount))^BE11) * (1+escalation)^BC11/(1+discount)^BC11* AT11","v":{"$error":"#N/A"}},{"$f":" ACkWh * (1+escalation)/(discount-escalation) * (1 - ((1+escalation)/(1+discount))^BC11) * AY11","v":{"$error":"#N/A"}},{"$f":" ACkWh * (1+escalation)/(discount-escalation) * (1 - ((1+escalation)/(1+discount))^BE11) * (1+escalation)^BC11/(1+discount)^BC11* AR11","v":{"$error":"#N/A"}},{"$error":"#N/A"},{"$error":"#N/A"},{"$error":"#N/A"},{"$f":" ACkW * (1+escalation)/(discount-escalation) * (1 - ((1+escalation)/(1+discount))^BD11)","v":834.51513283847316},{"$f":" ACkWh * (1+escalation)/(discount-escalation) * (1 - ((1+escalation)/(1+discount))^BD11)","v":1.0599385330964657},{"$error":"#N/A"},{"$error":"#N/A"},{"$error":"#N/A"},"Summer",0,0,0]

{"sheet":"HVAC Lookups","index":4,"n_rows":66,"n_cols":21,"rows_kept":66,"cut":false,"hidden":true,"merged":[]}
[null,"Table 1: Equipment Sizes",null,null,null,"Table 2: SEER Ranges",null,null,"Table 3: HSPF Ranges",null,null,null,"Table 4: Early Replacement Info"]
[null,"Btuh Min","Btuh Range","Nom Tons",null,"SEER Min","SEER Range",null,"HSPF Min","HSPF Range",null,null,"Manuf Year","Age of Replaced Unit","AC Remaining Useful Life (years)","HP Remaining Useful Life (years)","Baseline SEER","Baseline HSPF (Heat Pump)","Baseline HSPF (Electric Resistance)",null,"Equipment Types"]
[null,0,"< 15,000",1,null,14.5,"14.5-14.9",null,8.5,"8.5-8.9",null,null,"?","?",7,6,10,6.8,3.41,null,"Central A/C with Gas Heat"]
[null,15000,"15,000-20,999",1.5,null,15,"15.0-15.9",null,9,"9.0-9.4",null,null,{"$f":"M5-1","v":1996},25,0,0,10,6.8,3.41,null,"Central A/C with Electric Heat"]
[null,21000,"21,000-26,999",2,null,16,"16.0-16.9",null,9.5,"9.5-9.9",null,null,1997,24,1,0,10,6.8,3.41,null,"Central Heat Pump"]
[null,27000,"27,000-32,999",2.5,null,17,"17.0-17.9",null,10,"10.0-10.4",null,null,1998,23,2,0,10,6.8,3.41,null,"Mini Split A/C"]
[null,33000,"33,000-38,999",3,null,18,"18.0-20.9",null,10.5,"10.5-10.9",null,null,1999,22,3,0,10,6.8,3.41,null,"Mini Split Heat Pump"]
[null,39000,"39,000-44,999",3.5,null,21,"21.0-23.9",null,11,"11.0-11.4",null,null,2000,21,4,0,10,6.8,3.41]
[null,45000,"45,000-53,999",4,null,24,"24.0+",null,11.5,"11.5-11.9",null,null,2001,20,5,1,10,6.8,3.41]
[null,54000,"54,000-64,999",5,null,null,null,null,12,"12.0+",null,null,2002,19,6,2,10,6.8,3.41]
[null,null,null,null,null,null,null,null,null,null,null,null,2003,18,7,3,10,6.8,3.41]
[null,"AC kW:",80,null,null,null,null,null,null,null,null,null,2004,17,7.6,4,10,6.8,3.41]
[null,"AC kWh:",0.10161000000000001,null,null,null,null,null,null,null,null,null,2005,16,7.9,5,10,6.8,3.41]
[null,"discount:",7.0250000000000007E-2,null,null,null,null,null,null,null,null,null,2006,15,8.1999999999999993,6,10,6.8,3.41]
[null,"escalation:",0.02,null,null,null,null,null,null,null,null,null,2007,14,8.6,7,12.44,7.7,3.41]
[null,null,null,null,null,null,null,null,null,null,null,null,2008,13,9,7.6,12.44,7.7,3.41]
[null,"Incentive Lookups",null,null,"SEER Range",null,null,null,null,null,null,null,2009,12,9.4,7.9,12.44,7.7,3.41]
[null,"Project Type","Program","Size","14.5-14.9","15.0-15.9","16.0-16.9","17.0-17.9","18.0-20.9","21.0-23.9","24.0+",null,2010,11,9.8000000000000007,8.1999999999999993,12.44,7.7,3.41]
[null,"New Construction","Residential",1,14,28,49,56.5,59.5,91,115.5,null,2011,10,10.3,8.5,12.44,7.7,3.41]
[null,"New Construction","Residential",1.5,21,38.5,73.5,82.25,91,136.5,171.5,null,2012,9,10.8,8.9,12.44,7.7,3.41]
[null,"New Construction","Residential",2,28,52.5,98,110.25,122.5,182,227.5,null,2013,8,11.3,9.3000000000000007,12.44,7.7,3.41]
[null,"New Construction","Residential",2.5,35,66.5,122.5,136.5,150.5,227.5,287.5,null,2014,7,11.9,9.6999999999999993,12.44,7.7,3.41]
[null,"New Construction","Residential",3,42,80.5,147,164.5,182,273,343,null,2015,6,12.6,10.199999999999999,12.44,7.7,3.41]
[null,"New Construction","Residential",3.5,49,94.5,171.5,192.5,213.5,315,402.5,null,2016,5,13.3,10.7,12.44,7.7,3.41]
[null,"New Construction","Residential",4,56,105,199.5,222.25,245,360.5,458.5,null,2017,4,14.1,11.3,12.44,7.7,3.41]
[null,"New Construction","Residential",5,70,133,248.5,276.5,304.5,451.5,574,null,2018,3,14.9,12,12.44,7.7,3.41]
[null,"New Construction","Income Qualified",1,18,36,63,72.5,76.5,117,148.5,null,{"$f":"M28-1","v":2019},2,15.8,12.7,12.44,7.7,3.41]
[null,"New Construction","Income Qualified",1.5,27,49.5,94.5,105.75,117,175.5,220.5,null,{"$f":"N30-1","v":2020},1,16.8,13.7,12.44,7.7,3.41]
[null,"New Construction","Income Qualified",2,36,67.5,126,141.75,157.5,234,292.5]
[null,"New Construction","Income Qualified",2.5,45,85.5,157.5,175.5,193.5,292.5,369,null,"Program Year:",2021]
[null,"New Construction","Income Qualified",3,54,103.5,189,211.5,234,351,441]
[null,"New Construction","Income Qualified",3.5,63,121.5,220.5,247.5,274.5,405,517.5]
[null,"New Construction","Income Qualified",4,72,135,256.5,285.75,315,463.5,589.5]
[null,"New Construction","Income Qualified",5,90,171,319.5,355.5,391.5,580.5,738]
[null,"Replace On Burnout","Residential",1,38.5,52.5,73.5,83.5,84,115.5,140]
[null,"Replace On Burnout","Residential",1.5,56,77,112,120.75,129.5,171.5,210]
[null,"Replace On Burnout","Residential",2,77,101.5,147,159.25,171.5,231,276.5]
[null,"Replace On Burnout","Residential",2.5,94.5,126,185.5,199.5,213.5,287,346.5]
[null,"Replace On Burnout","Residential",3,115.5,154,220.5,238,255.5,343,416.5]
[null,"Replace On Burnout","Residential",3.5,133,178.5,259,278.25,297.5,402.5,486.5]
[null,"Replace On Burnout","Residential",4,154,203,294,316.75,339.5,458.5,556.5]
[null,"Replace On Burnout","Residential",5,192.5,255.5,367.5,397.25,427,574,693]
[null,"Replace On Burnout","Income Qualified",1,49.5,67.5,94.5,107,108,148.5,180]
[null,"Replace On Burnout","Income Qualified",1.5,72,99,144,155.25,166.5,220.5,270]
[null,"Replace On Burnout","Income Qualified",2,99,130.5,189,204.75,220.5,297,355.5]
[null,"Replace On Burnout","Income Qualified",2.5,121.5,162,238.5,256.5,274.5,369,445.5]
[null,"Replace On Burnout","Income Qualified",3,148.5,198,283.5,306,328.5,441,535.5]
[null,"Replace On Burnout","Income Qualified",3.5,171,229.5,333,357.75,382.5,517.5,625.5]
[null,"Replace On Burnout","Income Qualified",4,198,261,378,407.25,436.5,589.5,715.5]
[null,"Replace On Burnout","Income Qualified",5,247.5,328.5,472.5,510.75,549,738,891]
[null,"Early Retirement","Residential",1]
[null,"Early Retirement","Residential",1.5]
[null,"Early Retirement","Residential",2]
[null,"Early Retirement","Residential",2.5]
[null,"Early Retirement","Residential",3]
[null,"Early Retirement","Residential",3.5]
[null,"Early Retirement","Residential",4]
[null,"Early Retirement","Residential",5]
[null,"Early Retirement","Income Qualified",1]
[null,"Early Retirement","Income Qualified",1.5]
[null,"Early Retirement","Income Qualified",2]
[null,"Early Retirement","Income Qualified",2.5]
[null,"Early Retirement","Income Qualified",3]
[null,"Early Retirement","Income Qualified",3.5]
[null,"Early Retirement","Income Qualified",4]
[null,"Early Retirement","Income Qualified",5]

{"sheet":"Cooling NC","index":5,"n_rows":12,"n_cols":18,"rows_kept":12,"cut":false,"hidden":true,"merged":[[2,0,3,0],[2,10,3,10]]}
[]
["Table A‑5: Energy Savings (Cooling kWh) for 14.0 SEER New Construction Baseline—Zone 5",null,null,null,null,null,null,null,null,null,"Table A‑45: Summer Demand Savings for 14.0 SEER New Construction Baseline—Zone 5"]
["Size (Btuh)","SEER Range",null,null,null,null,null,null,null,null,"Size (Btuh)","SEER Range"]
[null,"14.5–14.9","15.0–15.9","16.0–16.9","17.0–17.9","18.0–20.9","21.0-23.9","24.0+",null,null,null,"14.5–14.9","15.0–15.9","16.0–16.9","17.0–17.9","18.0–20.9","21.0-23.9","24.0+"]
["< 15,000",60,115,213,378,437,582,692,null,null,"< 15,000",0.04,0.08,0.14000000000000001,0.13,0.17,0.26,0.33]
["15,000-20,999",90,172,320,566,655,873,1038,null,null,"15,000-20,999",0.06,0.11,0.21,0.19,0.26,0.39,0.49]
["21,000-26,999",119,230,427,755,873,1164,1384,null,null,"21,000-26,999",0.08,0.15,0.28000000000000003,0.25,0.35,0.52,0.65]
["27,000-32,999",149,287,533,944,1092,1455,1730,null,null,"27,000-32,999",0.1,0.19,0.35,0.31,0.43,0.65,0.82]
["33,000-38,999",179,345,640,1133,1310,1746,2076,null,null,"33,000-38,999",0.12,0.23,0.42,0.38,0.52,0.78,0.98]
["39,000-44,999",209,402,746,1322,1528,2037,2422,null,null,"39,000-44,999",0.14000000000000001,0.27,0.49,0.44,0.61,0.9,1.1499999999999999]
["45,000-53,999",239,459,853,1511,1747,2328,2768,null,null,"45,000-53,999",0.16,0.3,0.56999999999999995,0.5,0.7,1.03,1.31]
["54,000-64,999",299,574,1066,1888,2183,2910,3460,null,null,"54,000-64,999",0.2,0.38,0.71,0.63,0.87,1.29,1.64]

{"sheet":"Cooling ROB","index":6,"n_rows":79,"n_cols":22,"rows_kept":79,"cut":false,"hidden":true,"merged":[]}
["SEER Range"]
[null,null,"Table A‑10: Energy Savings (Cooling kWh) for 13.08 SEER Replace-on-Burnout Baseline—Zone 5",null,null,null,null,null,null,null,null,null,null,"Table A‑50: Summer Demand Savings for 13.08 SEER Replace-on-Burnout Baseline—Zone 5"]
[{"$f":"IF(C4=\"Size (Btuh) Post\",LEFT(C3,SEARCH(\"SEER\",C3)-2),A2)","v":"14.5-14.9"},null,"14.5-14.9 SEER",null,null,null,null,null,null,null,null,null,null,"14.5-14.9 SEER"]
["14.5-14.9",null,"Size (Btuh) Post","< 15,000","15,000-20,999","21,000-26,999","27,000-32,999","33,000-38,999","39,000-44,999","45,000-53,999","54,000-64,999",null,null,"Size (Btuh) Post","< 15,000","15,000-20,999","21,000-26,999","27,000-32,999","33,000-38,999","39,000-44,999","45,000-53,999","54,000-64,999"]
["14.5-14.9",null,"Size (Btuh) Pre",null,null,null,null,null,null,null,null,null,null,"Size (Btuh) Pre"]
["14.5-14.9",null,"< 15,000",165,null,null,null,null,null,null,null,null,null,"< 15,000",0.11]
["14.5-14.9",null,"15,000-20,999",964,247,null,null,null,null,null,null,null,null,"15,000-20,999",0.64,0.16]
[{"$f":"IF(C9=\"Size (Btuh) Post\",LEFT(C8,SEARCH(\"SEER\",C8)-2),A7)","v":"14.5-14.9"},null,"21,000-26,999",1763,1046,329,null,null,null,null,null,null,null,"21,000-26,999",1.17,0.69,0.22]
["14.5-14.9",null,"27,000-32,999",2562,1845,1128,412,null,null,null,null,null,null,"27,000-32,999",1.7,1.22,0.75,0.27]
["14.5-14.9",null,"33,000-38,999",3361,2644,1927,1211,494,null,null,null,null,null,"33,000-38,999",2.23,1.75,1.28,0.8,0.33]
["14.5-14.9",null,"39,000-44,999",4160,3443,2726,2010,1293,577,null,null,null,null,"39,000-44,999",2.76,2.2799999999999998,1.81,1.33,0.86,0.38]
["14.5-14.9",null,"45,000-53,999",4959,4242,3525,2809,2092,1376,659,null,null,null,"45,000-53,999",3.29,2.81,2.34,1.86,1.39,0.91,0.44]
["14.5-14.9",null,"54,000-64,999",6557,5840,5123,4407,3690,2974,2257,824,null,null,"54,000-64,999",4.3499999999999996,3.87,3.4,2.92,2.4500000000000002,1.97,1.5,0.55000000000000004]
["15.0-15.9",null,"15.0-15.9 SEER",null,null,null,null,null,null,null,null,null,null,"15.0-15.9 SEER"]
["15.0-15.9",null,"Size (Btuh) Post","< 15,000","15,000-20,999","21,000-26,999","27,000-32,999","33,000-38,999","39,000-44,999","45,000-53,999","54,000-64,999",null,null,"Size (Btuh) Post","< 15,000","15,000-20,999","21,000-26,999","27,000-32,999","33,000-38,999","39,000-44,999","45,000-53,999","54,000-64,999"]
["15.0-15.9",null,"Size (Btuh) Pre",null,null,null,null,null,null,null,null,null,null,"Size (Btuh) Pre"]
["15.0-15.9",null,"< 15,000",220,null,null,null,null,null,null,null,null,null,"< 15,000",0.15]
["15.0-15.9",null,"15,000-20,999",1019,330,null,null,null,null,null,null,null,null,"15,000-20,999",0.68,0.22]
["15.0-15.9",null,"21,000-26,999",1818,1129,440,null,null,null,null,null,null,null,"21,000-26,999",1.2,0.75,0.28999999999999998]
["15.0-15.9",null,"27,000-32,999",2617,1928,1239,550,null,null,null,null,null,null,"27,000-32,999",1.73,1.28,0.82,0.36]
["15.0-15.9",null,"33,000-38,999",3416,2727,2038,1349,660,null,null,null,null,null,"33,000-38,999",2.2599999999999998,1.81,1.35,0.89,0.44]
["15.0-15.9",null,"39,000-44,999",4215,3526,2837,2148,1459,770,null,null,null,null,"39,000-44,999",2.79,2.34,1.88,1.42,0.97,0.51]
["15.0-15.9",null,"45,000-53,999",5014,4325,3636,2947,2258,1569,879,null,null,null,"45,000-53,999",3.32,2.87,2.41,1.95,1.5,1.04,0.57999999999999996]
["15.0-15.9",null,"54,000-64,999",6612,5923,5234,4545,3856,3167,2477,1099,null,null,"54,000-64,999",4.38,3.93,3.47,3.01,2.56,2.1,1.64,0.73]
["16.0-16.9",null,"16.0-16.9 SEER",null,null,null,null,null,null,null,null,null,null,"16.0-16.9 SEER"]
["16.0-16.9",null,"Size (Btuh) Post","< 15,000","15,000-20,999","21,000-26,999","27,000-32,999","33,000-38,999","39,000-44,999","45,000-53,999","54,000-64,999",null,null,"Size (Btuh) Post","< 15,000","15,000-20,999","21,000-26,999","27,000-32,999","33,000-38,999","39,000-44,999","45,000-53,999","54,000-64,999"]
["16.0-16.9",null,"Size (Btuh) Pre",null,null,null,null,null,null,null,null,null,null,"Size (Btuh) Pre"]
["16.0-16.9",null,"< 15,000",318,null,null,null,null,null,null,null,null,null,"< 15,000",0.21]
["16.0-16.9",null,"15,000-20,999",1117,477,null,null,null,null,null,null,null,null,"15,000-20,999",0.74,0.32]
["16.0-16.9",null,"21,000-26,999",1916,1276,637,null,null,null,null,null,null,null,"21,000-26,999",1.27,0.85,0.42]
["16.0-16.9",null,"27,000-32,999",2715,2075,1436,796,null,null,null,null,null,null,"27,000-32,999",1.8,1.38,0.95,0.53]
["16.0-16.9",null,"33,000-38,999",3514,2874,2235,1595,955,null,null,null,null,null,"33,000-38,999",2.33,1.9,1.48,1.06,0.63]
["16.0-16.9",null,"39,000-44,999",4313,3673,3034,2394,1754,1114,null,null,null,null,"39,000-44,999",2.86,2.4300000000000002,2.0099999999999998,1.59,1.1599999999999999,0.74]
["16.0-16.9",null,"45,000-53,999",5112,4472,3833,3193,2553,1913,1273,null,null,null,"45,000-53,999",3.39,2.96,2.54,2.12,1.69,1.27,0.84]
["16.0-16.9",null,"54,000-64,999",6710,6070,5431,4791,4151,3511,2871,1591,null,null,"54,000-64,999",4.45,4.0199999999999996,3.6,3.17,2.75,2.33,1.9,1.05]
["17.0-17.9",null,"17.0-17.9 SEER",null,null,null,null,null,null,null,null,null,null,"17.0-17.9 SEER"]
["17.0-17.9",null,"Size (Btuh) Post","< 15,000","15,000-20,999","21,000-26,999","27,000-32,999","33,000-38,999","39,000-44,999","45,000-53,999","54,000-64,999",null,null,"Size (Btuh) Post","< 15,000","15,000-20,999","21,000-26,999","27,000-32,999","33,000-38,999","39,000-44,999","45,000-53,999","54,000-64,999"]
["17.0-17.9",null,"Size (Btuh) Pre",null,null,null,null,null,null,null,null,null,null,"Size (Btuh) Pre"]
["17.0-17.9",null,"< 15,000",483,null,null,null,null,null,null,null,null,null,"< 15,000",0.2]
["17.0-17.9",null,"15,000-20,999",1282,724,null,null,null,null,null,null,null,null,"15,000-20,999",0.72,0.28999999999999998]
["17.0-17.9",null,"21,000-26,999",2081,1523,965,null,null,null,null,null,null,null,"21,000-26,999",1.25,0.82,0.39]
["17.0-17.9",null,"27,000-32,999",2880,2322,1764,1207,null,null,null,null,null,null,"27,000-32,999",1.78,1.35,0.92,0.49]
["17.0-17.9",null,"33,000-38,999",3679,3121,2563,2006,1448,null,null,null,null,null,"33,000-38,999",2.31,1.88,1.45,1.02,0.59]
["17.0-17.9",null,"39,000-44,999",4478,3920,3362,2805,2247,1689,null,null,null,null,"39,000-44,999",2.84,2.41,1.98,1.55,1.1200000000000001,0.68]
["17.0-17.9",null,"45,000-53,999",5277,4719,4161,3604,3046,2488,1931,null,null,null,"45,000-53,999",3.37,2.94,2.5099999999999998,2.08,1.65,1.21,0.78]
["17.0-17.9",null,"54,000-64,999",6875,6317,5759,5202,4644,4086,3529,2413,null,null,"54,000-64,999",4.43,4,3.57,3.14,2.7,2.27,1.84,0.98]
["18.0-20.9",null,"18.0-20.9 SEER",null,null,null,null,null,null,null,null,null,null,"18.0-20.9 SEER"]
["18.0-20.9",null,"Size (Btuh) Post","< 15,000","15,000-20,999","21,000-26,999","27,000-32,999","33,000-38,999","39,000-44,999","45,000-53,999","54,000-64,999",null,null,"Size (Btuh) Post","< 15,000","15,000-20,999","21,000-26,999","27,000-32,999","33,000-38,999","39,000-44,999","45,000-53,999","54,000-64,999"]
["18.0-20.9",null,"Size (Btuh) Pre",null,null,null,null,null,null,null,null,null,null,"Size (Btuh) Pre"]
["18.0-20.9",null,"< 15,000",542,null,null,null,null,null,null,null,null,null,"< 15,000",0.24]
["18.0-20.9",null,"15,000-20,999",1341,813,null,null,null,null,null,null,null,null,"15,000-20,999",0.77,0.37]
["18.0-20.9",null,"21,000-26,999",2140,1612,1083,null,null,null,null,null,null,null,"21,000-26,999",1.3,0.89,0.49]
["18.0-20.9",null,"27,000-32,999",2939,2411,1882,1354,null,null,null,null,null,null,"27,000-32,999",1.83,1.42,1.02,0.61]
["18.0-20.9",null,"33,000-38,999",3738,3210,2681,2153,1625,null,null,null,null,null,"33,000-38,999",2.36,1.95,1.55,1.1399999999999999,0.73]
["18.0-20.9",null,"39,000-44,999",4537,4009,3480,2952,2424,1896,null,null,null,null,"39,000-44,999",2.89,2.48,2.08,1.67,1.26,0.85]
["18.0-20.9",null,"45,000-53,999",5336,4808,4279,3751,3223,2695,2167,null,null,null,"45,000-53,999",3.42,3.01,2.61,2.2000000000000002,1.79,1.38,0.97]
["18.0-20.9",null,"54,000-64,999",6934,6406,5877,5349,4821,4293,3765,2708,null,null,"54,000-64,999",4.4800000000000004,4.07,3.66,3.26,2.85,2.44,2.0299999999999998,1.22]
["21.0-23.9",null,"21.0-23.9 SEER",null,null,null,null,null,null,null,null,null,null,"21.0-23.9 SEER"]
["21.0-23.9",null,"Size (Btuh) Post","< 15,000","15,000-20,999","21,000-26,999","27,000-32,999","33,000-38,999","39,000-44,999","45,000-53,999","54,000-64,999",null,null,"Size (Btuh) Post","< 15,000","15,000-20,999","21,000-26,999","27,000-32,999","33,000-38,999","39,000-44,999","45,000-53,999","54,000-64,999"]
["21.0-23.9",null,"Size (Btuh) Pre",null,null,null,null,null,null,null,null,null,null,"Size (Btuh) Pre"]
["21.0-23.9",null,"< 15,000",687,null,null,null,null,null,null,null,null,null,"< 15,000",0.33]
["21.0-23.9",null,"15,000-20,999",1486,1031,null,null,null,null,null,null,null,null,"15,000-20,999",0.86,0.49]
["21.0-23.9",null,"21,000-26,999",2285,1830,1374,null,null,null,null,null,null,null,"21,000-26,999",1.39,1.02,0.66]
["21.0-23.9",null,"27,000-32,999",3084,2629,2173,1718,null,null,null,null,null,null,"27,000-32,999",1.92,1.55,1.19,0.82]
["21.0-23.9",null,"33,000-38,999",3883,3428,2972,2517,2061,null,null,null,null,null,"33,000-38,999",2.4500000000000002,2.08,1.72,1.35,0.98]
["21.0-23.9",null,"39,000-44,999",4682,4227,3771,3316,2860,2405,null,null,null,null,"39,000-44,999",2.98,2.61,2.2400000000000002,1.88,1.51,1.1499999999999999]
["21.0-23.9",null,"45,000-53,999",5481,5026,4570,4115,3659,3204,2748,null,null,null,"45,000-53,999",3.51,3.14,2.77,2.41,2.04,1.68,1.31]
["21.0-23.9",null,"54,000-64,999",7079,6624,6168,5713,5257,4802,4346,3435,null,null,"54,000-64,999",4.5599999999999996,4.2,3.83,3.47,3.1,2.74,2.37,1.64]
["24.0+",null,"24.0+ SEER",null,null,null,null,null,null,null,null,null,null,"24.0+ SEER"]
["24.0+",null,"Size (Btuh) Post","< 15,000","15,000-20,999","21,000-26,999","27,000-32,999","33,000-38,999","39,000-44,999","45,000-53,999","54,000-64,999",null,null,"Size (Btuh) Post","< 15,000","15,000-20,999","21,000-26,999","27,000-32,999","33,000-38,999","39,000-44,999","45,000-53,999","54,000-64,999"]
["24.0+",null,"Size (Btuh) Pre",null,null,null,null,null,null,null,null,null,null,"Size (Btuh) Pre"]
[{"$f":"IF(C73=\"Size (Btuh) Post\",LEFT(C72,SEARCH(\"SEER\",C72)-2),A71)","v":"24.0+"},null,"< 15,000",797,null,null,null,null,null,null,null,null,null,"< 15,000",0.4]
["24.0+",null,"15,000-20,999",1596,1196,null,null,null,null,null,null,null,null,"15,000-20,999",0.93,0.6]
["24.0+",null,"21,000-26,999",2395,1995,1594,null,null,null,null,null,null,null,"21,000-26,999",1.46,1.1200000000000001,0.79]
["24.0+",null,"27,000-32,999",3194,2794,2393,1993,null,null,null,null,null,null,"27,000-32,999",1.99,1.65,1.32,0.99]
["24.0+",null,"33,000-38,999",3993,3593,3192,2792,2391,null,null,null,null,null,"33,000-38,999",2.5099999999999998,2.1800000000000002,1.85,1.52,1.19]
["24.0+",null,"39,000-44,999",4792,4392,3991,3591,3190,2790,null,null,null,null,"39,000-44,999",3.04,2.71,2.38,2.0499999999999998,1.72,1.39]
["24.0+",null,"45,000-53,999",5591,5191,4790,4390,3989,3589,3188,null,null,null,"45,000-53,999",3.57,3.24,2.91,2.58,2.25,1.92,1.59]
["24.0+",null,"54,000-64,999",7189,6789,6388,5988,5587,5187,4786,3986,null,null,"54,000-64,999",4.63,4.3,3.97,3.64,3.31,2.98,2.65,1.98]

{"sheet":"Cooling ER","index":7,"n_rows":158,"n_cols":22,"rows_kept":158,"cut":false,"hidden":true,"merged":[]}
["Baseline SEER","SEER Range"]
[{"$f":"IFERROR(_xlfn.NUMBERVALUE(MID(C2,SEARCH(\"SEER Early\",C2)-6,5)),#REF!)","v":12.44},null,"Table A‑19: Energy Savings (Cooling kWh) for 12.44 SEER Early Retirement Baseline—Zone 5",null,null,null,null,null,null,null,null,null,null,"Table A‑59: Summer Demand Savings for 12.44 SEER Early Retirement Baseline—Zone 5"]
[{"$f":"IFERROR(_xlfn.NUMBERVALUE(MID(C3,SEARCH(\"SEER Early\",C3)-6,5)),A2)","v":12.44},{"$f":"IF(C4=\"Size (Btuh) Post\",LEFT(C3,SEARCH(\"SEER\",C3)-2),B2)","v":"14.5-14.9"},"14.5-14.9 SEER",null,null,null,null,null,null,null,null,null,null,"14.5-14.9 SEER"]
[12.44,"14.5-14.9","Size (Btuh) Post","< 15,000","15,000-20,999","21,000-26,999","27,000-32,999","33,000-38,999","39,000-44,999","45,000-53,999","54,000-64,999",null,null,"Size (Btuh) Post","< 15,000","15,000-20,999","21,000-26,999","27,000-32,999","33,000-38,999","39,000-44,999","45,000-53,999","54,000-64,999"]
[12.44,"14.5-14.9","Size (Btuh) Pre",null,null,null,null,null,null,null,null,null,null,"Size (Btuh) Pre"]
[12.44,"14.5-14.9","< 15,000",247,null,null,null,null,null,null,null,null,null,"< 15,000",0.16]
[12.44,"14.5-14.9","15,000-20,999",1087,370,null,null,null,null,null,null,null,null,"15,000-20,999",0.72,0.25]
[12.44,"14.5-14.9","21,000-26,999",1927,1211,494,null,null,null,null,null,null,null,"21,000-26,999",1.28,0.8,0.33]
[12.44,"14.5-14.9","27,000-32,999",2767,2051,1334,617,null,null,null,null,null,null,"27,000-32,999",1.83,1.36,0.88,0.41]
[12.44,"14.5-14.9","33,000-38,999",3607,2891,2174,1457,741,null,null,null,null,null,"33,000-38,999",2.39,1.92,1.44,0.97,0.49]
[12.44,"14.5-14.9","39,000-44,999",4448,3731,3014,2298,1581,864,null,null,null,null,"39,000-44,999",2.95,2.4700000000000002,2,1.52,1.05,0.56999999999999995]
[{"$f":"IFERROR(_xlfn.NUMBERVALUE(MID(C12,SEARCH(\"SEER Early\",C12)-6,5)),A11)","v":12.44},{"$f":"IF(C13=\"Size (Btuh) Post\",LEFT(C12,SEARCH(\"SEER\",C12)-2),B11)","v":"14.5-14.9"},"45,000-53,999",5288,4571,3854,3138,2421,1704,988,null,null,null,"45,000-53,999",3.5,3.03,2.5499999999999998,2.08,1.6,1.1299999999999999,0.65]
[12.44,"14.5-14.9","54,000-64,999",6968,6251,5535,4818,4101,3385,2668,1235,null,null,"54,000-64,999",4.62,4.1399999999999997,3.67,3.19,2.72,2.2400000000000002,1.77,0.82]
[12.44,"15.0-15.9","15.0-15.9 SEER",null,null,null,null,null,null,null,null,null,null,"15.0-15.9 SEER"]
[12.44,"15.0-15.9","Size (Btuh) Post","< 15,000","15,000-20,999","21,000-26,999","27,000-32,999","33,000-38,999","39,000-44,999","45,000-53,999","54,000-64,999",null,null,"Size (Btuh) Post","< 15,000","15,000-20,999","21,000-26,999","27,000-32,999","33,000-38,999","39,000-44,999","45,000-53,999","54,000-64,999"]
[12.44,"15.0-15.9","Size (Btuh) Pre",null,null,null,null,null,null,null,null,null,null,"Size (Btuh) Pre"]
[12.44,"15.0-15.9","< 15,000",302,null,null,null,null,null,null,null,null,null,"< 15,000",0.2]
[12.44,"15.0-15.9","15,000-20,999",1142,453,null,null,null,null,null,null,null,null,"15,000-20,999",0.76,0.3]
[12.44,"15.0-15.9","21,000-26,999",1982,1293,604,null,null,null,null,null,null,null,"21,000-26,999",1.31,0.86,0.4]
[12.44,"15.0-15.9","27,000-32,999",2822,2133,1444,755,null,null,null,null,null,null,"27,000-32,999",1.87,1.41,0.96,0.5]
[12.44,"15.0-15.9","33,000-38,999",3663,2973,2284,1595,906,null,null,null,null,null,"33,000-38,999",2.4300000000000002,1.97,1.51,1.06,0.6]
[12.44,"15.0-15.9","39,000-44,999",4503,3814,3124,2435,1746,1057,null,null,null,null,"39,000-44,999",2.98,2.5299999999999998,2.0699999999999998,1.61,1.1599999999999999,0.7]
[12.44,"15.0-15.9","45,000-53,999",5343,4654,3965,3276,2586,1897,1208,null,null,null,"45,000-53,999",3.54,3.08,2.63,2.17,1.71,1.26,0.8]
[12.44,"15.0-15.9","54,000-64,999",7023,6334,5645,4956,4267,3578,2889,1510,null,null,"54,000-64,999",4.6500000000000004,4.2,3.74,3.28,2.83,2.37,1.91,1]
[12.44,"16.0-16.9","16.0-16.9 SEER",null,null,null,null,null,null,null,null,null,null,"16.0-16.9 SEER"]
[12.44,"16.0-16.9","Size (Btuh) Post","< 15,000","15,000-20,999","21,000-26,999","27,000-32,999","33,000-38,999","39,000-44,999","45,000-53,999","54,000-64,999",null,null,"Size (Btuh) Post","< 15,000","15,000-20,999","21,000-26,999","27,000-32,999","33,000-38,999","39,000-44,999","45,000-53,999","54,000-64,999"]
[12.44,"16.0-16.9","Size (Btuh) Pre",null,null,null,null,null,null,null,null,null,null,"Size (Btuh) Pre"]
[12.44,"16.0-16.9","< 15,000",401,null,null,null,null,null,null,null,null,null,"< 15,000",0.27]
[12.44,"16.0-16.9","15,000-20,999",1241,601,null,null,null,null,null,null,null,null,"15,000-20,999",0.82,0.4]
[12.44,"16.0-16.9","21,000-26,999",2081,1441,801,null,null,null,null,null,null,null,"21,000-26,999",1.38,0.95,0.53]
[12.44,"16.0-16.9","27,000-32,999",2921,2281,1641,1001,null,null,null,null,null,null,"27,000-32,999",1.94,1.51,1.0900000000000001,0.66]
[12.44,"16.0-16.9","33,000-38,999",3761,3121,2481,1841,1202,null,null,null,null,null,"33,000-38,999",2.4900000000000002,2.0699999999999998,1.64,1.22,0.8]
[12.44,"16.0-16.9","39,000-44,999",4601,3961,3321,2681,2042,1402,null,null,null,null,"39,000-44,999",3.05,2.63,2.2000000000000002,1.78,1.35,0.93]
[12.44,"16.0-16.9","45,000-53,999",5441,4801,4161,3522,2882,2242,1602,null,null,null,"45,000-53,999",3.61,3.18,2.76,2.33,1.91,1.49,1.06]
[12.44,"16.0-16.9","54,000-64,999",7121,6482,5842,5202,4562,3922,3282,2003,null,null,"54,000-64,999",4.72,4.3,3.87,3.45,3.02,2.6,2.1800000000000002,1.33]
[12.44,"17.0-17.9","17.0-17.9 SEER",null,null,null,null,null,null,null,null,null,null,"17.0-17.9 SEER"]
[12.44,"17.0-17.9","Size (Btuh) Post","< 15,000","15,000-20,999","21,000-26,999","27,000-32,999","33,000-38,999","39,000-44,999","45,000-53,999","54,000-64,999",null,null,"Size (Btuh) Post","< 15,000","15,000-20,999","21,000-26,999","27,000-32,999","33,000-38,999","39,000-44,999","45,000-53,999","54,000-64,999"]
[12.44,"17.0-17.9","Size (Btuh) Pre",null,null,null,null,null,null,null,null,null,null,"Size (Btuh) Pre"]
[12.44,"17.0-17.9","< 15,000",565,null,null,null,null,null,null,null,null,null,"< 15,000",0.25]
[12.44,"17.0-17.9","15,000-20,999",1405,847,null,null,null,null,null,null,null,null,"15,000-20,999",0.81,0.37]
[12.44,"17.0-17.9","21,000-26,999",2245,1687,1130,null,null,null,null,null,null,null,"21,000-26,999",1.36,0.93,0.5]
[12.44,"17.0-17.9","27,000-32,999",3085,2528,1970,1412,null,null,null,null,null,null,"27,000-32,999",1.92,1.49,1.06,0.62]
[12.44,"17.0-17.9","33,000-38,999",3925,3368,2810,2252,1695,null,null,null,null,null,"33,000-38,999",2.48,2.0499999999999998,1.61,1.18,0.75]
[12.44,"17.0-17.9","39,000-44,999",4765,4208,3650,3092,2535,1977,null,null,null,null,"39,000-44,999",3.03,2.6,2.17,1.74,1.31,0.87]
[12.44,"17.0-17.9","45,000-53,999",5606,5048,4490,3933,3375,2817,2259,null,null,null,"45,000-53,999",3.59,3.16,2.73,2.2999999999999998,1.86,1.43,1]
[12.44,"17.0-17.9","54,000-64,999",7286,6728,6170,5613,5055,4497,3940,2824,null,null,"54,000-64,999",4.7,4.2699999999999996,3.84,3.41,2.98,2.5499999999999998,2.11,1.25]
[12.44,"18.0-20.9","18.0-20.9 SEER",null,null,null,null,null,null,null,null,null,null,"18.0-20.9 SEER"]
[12.44,"18.0-20.9","Size (Btuh) Post","< 15,000","15,000-20,999","21,000-26,999","27,000-32,999","33,000-38,999","39,000-44,999","45,000-53,999","54,000-64,999",null,null,"Size (Btuh) Post","< 15,000","15,000-20,999","21,000-26,999","27,000-32,999","33,000-38,999","39,000-44,999","45,000-53,999","54,000-64,999"]
[12.44,"18.0-20.9","Size (Btuh) Pre",null,null,null,null,null,null,null,null,null,null,"Size (Btuh) Pre"]
[12.44,"18.0-20.9","< 15,000",624,null,null,null,null,null,null,null,null,null,"< 15,000",0.3]
[12.44,"18.0-20.9","15,000-20,999",1464,936,null,null,null,null,null,null,null,null,"15,000-20,999",0.85,0.45]
[12.44,"18.0-20.9","21,000-26,999",2304,1776,1248,null,null,null,null,null,null,null,"21,000-26,999",1.41,1,0.6]
[12.44,"18.0-20.9","27,000-32,999",3144,2616,2088,1560,null,null,null,null,null,null,"27,000-32,999",1.97,1.56,1.1499999999999999,0.75]
[12.44,"18.0-20.9","33,000-38,999",3984,3456,2928,2400,1872,null,null,null,null,null,"33,000-38,999",2.5299999999999998,2.12,1.71,1.3,0.89]
[12.44,"18.0-20.9","39,000-44,999",4824,4296,3768,3240,2712,2184,null,null,null,null,"39,000-44,999",3.08,2.67,2.27,1.86,1.45,1.04]
[12.44,"18.0-20.9","45,000-53,999",5665,5136,4608,4080,3552,3024,2496,null,null,null,"45,000-53,999",3.64,3.23,2.82,2.42,2.0099999999999998,1.6,1.19]
[12.44,"18.0-20.9","54,000-64,999",7345,6817,6288,5760,5232,4704,4176,3120,null,null,"54,000-64,999",4.75,4.34,3.94,3.53,3.12,2.71,2.31,1.49]
[12.44,"21.0-23.9","21.0-23.9 SEER",null,null,null,null,null,null,null,null,null,null,"21.0-23.9 SEER"]
[12.44,"21.0-23.9","Size (Btuh) Post","< 15,000","15,000-20,999","21,000-26,999","27,000-32,999","33,000-38,999","39,000-44,999","45,000-53,999","54,000-64,999",null,null,"Size (Btuh) Post","< 15,000","15,000-20,999","21,000-26,999","27,000-32,999","33,000-38,999","39,000-44,999","45,000-53,999","54,000-64,999"]
[12.44,"21.0-23.9","Size (Btuh) Pre",null,null,null,null,null,null,null,null,null,null,"Size (Btuh) Pre"]
[12.44,"21.0-23.9","< 15,000",769,null,null,null,null,null,null,null,null,null,"< 15,000",0.38]
[12.44,"21.0-23.9","15,000-20,999",1609,1154,null,null,null,null,null,null,null,null,"15,000-20,999",0.94,0.56999999999999995]
[12.44,"21.0-23.9","21,000-26,999",2450,1994,1539,null,null,null,null,null,null,null,"21,000-26,999",1.5,1.1299999999999999,0.77]
[12.44,"21.0-23.9","27,000-32,999",3290,2834,2379,1923,null,null,null,null,null,null,"27,000-32,999",2.0499999999999998,1.69,1.32,0.96]
[12.44,"21.0-23.9","33,000-38,999",4130,3674,3219,2763,2308,null,null,null,null,null,"33,000-38,999",2.61,2.2400000000000002,1.88,1.51,1.1499999999999999]
[12.44,"21.0-23.9","39,000-44,999",4970,4514,4059,3603,3148,2693,null,null,null,null,"39,000-44,999",3.17,2.8,2.44,2.0699999999999998,1.7,1.34]
[12.44,"21.0-23.9","45,000-53,999",5810,5354,4899,4444,3988,3533,3077,null,null,null,"45,000-53,999",3.72,3.36,2.99,2.63,2.2599999999999998,1.9,1.53]
[12.44,"21.0-23.9","54,000-64,999",7490,7035,6579,6124,5668,5213,4757,3846,null,null,"54,000-64,999",4.84,4.47,4.1100000000000003,3.74,3.37,3.01,2.64,1.91]
[12.44,"24.0+","24.0+ SEER",null,null,null,null,null,null,null,null,null,null,"24.0+ SEER"]
[12.44,"24.0+","Size (Btuh) Post","< 15,000","15,000-20,999","21,000-26,999","27,000-32,999","33,000-38,999","39,000-44,999","45,000-53,999","54,000-64,999",null,null,"Size (Btuh) Post","< 15,000","15,000-20,999","21,000-26,999","27,000-32,999","33,000-38,999","39,000-44,999","45,000-53,999","54,000-64,999"]
[12.44,"24.0+","Size (Btuh) Pre",null,null,null,null,null,null,null,null,null,null,"Size (Btuh) Pre"]
[12.44,"24.0+","< 15,000",879,null,null,null,null,null,null,null,null,null,"< 15,000",0.45]
[12.44,"24.0+","15,000-20,999",1719,1319,null,null,null,null,null,null,null,null,"15,000-20,999",1.01,0.68]
[12.44,"24.0+","21,000-26,999",2560,2159,1759,null,null,null,null,null,null,null,"21,000-26,999",1.56,1.23,0.9]
[12.44,"24.0+","27,000-32,999",3400,2999,2599,2198,null,null,null,null,null,null,"27,000-32,999",2.12,1.79,1.46,1.1299999999999999]
[{"$f":"IFERROR(_xlfn.NUMBERVALUE(MID(C76,SEARCH(\"SEER Early\",C76)-6,5)),A75)","v":12.44},{"$f":"IF(C77=\"Size (Btuh) Post\",LEFT(C76,SEARCH(\"SEER\",C76)-2),B75)","v":"24.0+"},"33,000-38,999",4240,3839,3439,3038,2638,null,null,null,null,null,"33,000-38,999",2.68,2.35,2.02,1.69,1.35]
[12.44,"24.0+","39,000-44,999",5080,4679,4279,3879,3478,3078,null,null,null,null,"39,000-44,999",3.24,2.9,2.57,2.2400000000000002,1.91,1.58]
[12.44,"24.0+","45,000-53,999",5920,5520,5119,4719,4318,3918,3517,null,null,null,"45,000-53,999",3.79,3.46,3.13,2.8,2.4700000000000002,2.14,1.81]
[12.44,"24.0+","54,000-64,999",7600,7200,6799,6399,5998,5598,5198,4397,null,null,"54,000-64,999",4.91,4.57,4.24,3.91,3.58,3.25,2.92,2.2599999999999998]
[12.44,"24.0+"]
[10,"24.0+","Table A‑20: Energy Savings (Cooling kWh) for 10.0 SEER Early Retirement Baseline—Zone 5",null,null,null,null,null,null,null,null,null,null,"Table A‑60: Summer Demand Savings for 10.0 SEER Early Retirement Baseline—Zone 5"]
[10,"14.5-14.9","14.5-14.9 SEER",null,null,null,null,null,null,null,null,null,null,"14.5-14.9 SEER"]
[10,"14.5-14.9","Size (Btuh) Post","< 15,000","15,000-20,999","21,000-26,999","27,000-32,999","33,000-38,999","39,000-44,999","45,000-53,999","54,000-64,999",null,null,"Size (Btuh) Post","< 15,000","15,000-20,999","21,000-26,999","27,000-32,999","33,000-38,999","39,000-44,999","45,000-53,999","54,000-64,999"]
[10,"14.5-14.9","Size (Btuh) Pre",null,null,null,null,null,null,null,null,null,null,"Size (Btuh) Pre"]
[10,"14.5-14.9","< 15,000",657,null,null,null,null,null,null,null,null,null,"< 15,000",0.44]
[10,"14.5-14.9","15,000-20,999",1702,985,null,null,null,null,null,null,null,null,"15,000-20,999",1.1299999999999999,0.65]
[10,"14.5-14.9","21,000-26,999",2747,2030,1314,null,null,null,null,null,null,null,"21,000-26,999",1.82,1.35,0.87]
[10,"14.5-14.9","27,000-32,999",3792,3076,2359,1642,null,null,null,null,null,null,"27,000-32,999",2.5099999999999998,2.04,1.56,1.0900000000000001]
[10,"14.5-14.9","33,000-38,999",4837,4121,3404,2687,1971,null,null,null,null,null,"33,000-38,999",3.21,2.73,2.2599999999999998,1.78,1.31]
[10,"14.5-14.9","39,000-44,999",5882,5166,4449,3732,3016,2299,null,null,null,null,"39,000-44,999",3.9,3.42,2.95,2.4700000000000002,2,1.52]
[10,"14.5-14.9","45,000-53,999",6928,6211,5494,4778,4061,3344,2628,null,null,null,"45,000-53,999",4.59,4.12,3.64,3.17,2.69,2.2200000000000002,1.74]
[10,"14.5-14.9","54,000-64,999",9018,8301,7584,6868,6151,5435,4718,3285,null,null,"54,000-64,999",5.98,5.5,5.03,4.55,4.08,3.6,3.13,2.1800000000000002]
[10,"15.0-15.9","15.0-15.9 SEER",null,null,null,null,null,null,null,null,null,null,"15.0-15.9 SEER"]
[10,"15.0-15.9","Size (Btuh) Post","< 15,000","15,000-20,999","21,000-26,999","27,000-32,999","33,000-38,999","39,000-44,999","45,000-53,999","54,000-64,999",null,null,"Size (Btuh) Post","< 15,000","15,000-20,999","21,000-26,999","27,000-32,999","33,000-38,999","39,000-44,999","45,000-53,999","54,000-64,999"]
[10,"15.0-15.9","Size (Btuh) Pre",null,null,null,null,null,null,null,null,null,null,"Size (Btuh) Pre"]
[10,"15.0-15.9","< 15,000",712,null,null,null,null,null,null,null,null,null,"< 15,000",0.47]
[10,"15.0-15.9","15,000-20,999",1757,1068,null,null,null,null,null,null,null,null,"15,000-20,999",1.1599999999999999,0.71]
[10,"15.0-15.9","21,000-26,999",2802,2113,1424,null,null,null,null,null,null,null,"21,000-26,999",1.86,1.4,0.94]
[10,"15.0-15.9","27,000-32,999",3847,3158,2469,1780,null,null,null,null,null,null,"27,000-32,999",2.5499999999999998,2.09,1.64,1.18]
[10,"15.0-15.9","33,000-38,999",4892,4203,3514,2825,2136,null,null,null,null,null,"33,000-38,999",3.24,2.79,2.33,1.87,1.42]
[10,"15.0-15.9","39,000-44,999",5938,5248,4559,3870,3181,2492,null,null,null,null,"39,000-44,999",3.93,3.48,3.02,2.56,2.11,1.65]
[10,"15.0-15.9","45,000-53,999",6983,6294,5604,4915,4226,3537,2848,null,null,null,"45,000-53,999",4.63,4.17,3.71,3.26,2.8,2.34,1.89]
[10,"15.0-15.9","54,000-64,999",9073,8384,7695,7006,6317,5627,4938,3560,null,null,"54,000-64,999",6.01,5.56,5.0999999999999996,4.6399999999999997,4.1900000000000004,3.73,3.27,2.36]
[10,"16.0-16.9","16.0-16.9 SEER",null,null,null,null,null,null,null,null,null,null,"16.0-16.9 SEER"]
[10,"16.0-16.9","Size (Btuh) Post","< 15,000","15,000-20,999","21,000-26,999","27,000-32,999","33,000-38,999","39,000-44,999","45,000-53,999","54,000-64,999",null,null,"Size (Btuh) Post","< 15,000","15,000-20,999","21,000-26,999","27,000-32,999","33,000-38,999","39,000-44,999","45,000-53,999","54,000-64,999"]
[10,"16.0-16.9","Size (Btuh) Pre",null,null,null,null,null,null,null,null,null,null,"Size (Btuh) Pre"]
[10,"16.0-16.9","< 15,000",810,null,null,null,null,null,null,null,null,null,"< 15,000",0.54]
[10,"16.0-16.9","15,000-20,999",1856,1216,null,null,null,null,null,null,null,null,"15,000-20,999",1.23,0.81]
[10,"16.0-16.9","21,000-26,999",2901,2261,1621,null,null,null,null,null,null,null,"21,000-26,999",1.92,1.5,1.07]
[10,"16.0-16.9","27,000-32,999",3946,3306,2666,2026,null,null,null,null,null,null,"27,000-32,999",2.61,2.19,1.77,1.34]
[10,"16.0-16.9","33,000-38,999",4991,4351,3711,3071,2431,null,null,null,null,null,"33,000-38,999",3.31,2.88,2.46,2.04,1.61]
[10,"16.0-16.9","39,000-44,999",6036,5396,4756,4116,3477,2837,null,null,null,null,"39,000-44,999",4,3.58,3.15,2.73,2.2999999999999998,1.88]
[10,"16.0-16.9","45,000-53,999",7081,6441,5801,5162,4522,3882,3242,null,null,null,"45,000-53,999",4.6900000000000004,4.2699999999999996,3.84,3.42,3,2.57,2.15]
[10,"16.0-16.9","54,000-64,999",9171,8531,7892,7252,6612,5972,5332,4052,null,null,"54,000-64,999",6.08,5.65,5.23,4.8099999999999996,4.38,3.96,3.53,2.69]
[10,"17.0-17.9","17.0-17.9 SEER",null,null,null,null,null,null,null,null,null,null,"17.0-17.9 SEER"]
[10,"17.0-17.9","Size (Btuh) Post","< 15,000","15,000-20,999","21,000-26,999","27,000-32,999","33,000-38,999","39,000-44,999","45,000-53,999","54,000-64,999",null,null,"Size (Btuh) Post","< 15,000","15,000-20,999","21,000-26,999","27,000-32,999","33,000-38,999","39,000-44,999","45,000-53,999","54,000-64,999"]
[10,"17.0-17.9","Size (Btuh) Pre",null,null,null,null,null,null,null,null,null,null,"Size (Btuh) Pre"]
[10,"17.0-17.9","< 15,000",975,null,null,null,null,null,null,null,null,null,"< 15,000",0.52]
[10,"17.0-17.9","15,000-20,999",2020,1462,null,null,null,null,null,null,null,null,"15,000-20,999",1.21,0.78]
[10,"17.0-17.9","21,000-26,999",3065,2507,1950,null,null,null,null,null,null,null,"21,000-26,999",1.91,1.48,1.04]
[10,"17.0-17.9","27,000-32,999",4110,3552,2995,2437,null,null,null,null,null,null,"27,000-32,999",2.6,2.17,1.74,1.3]
[10,"17.0-17.9","33,000-38,999",5155,4598,4040,3482,2925,null,null,null,null,null,"33,000-38,999",3.29,2.86,2.4300000000000002,2,1.56]
[10,"17.0-17.9","39,000-44,999",6200,5643,5085,4527,3970,3412,null,null,null,null,"39,000-44,999",3.98,3.55,3.12,2.69,2.2599999999999998,1.83]
[10,"17.0-17.9","45,000-53,999",7245,6688,6130,5572,5015,4457,3899,null,null,null,"45,000-53,999",4.68,4.25,3.81,3.38,2.95,2.52,2.09]
[10,"17.0-17.9","54,000-64,999",9336,8778,8220,7663,7105,6547,5990,4874,null,null,"54,000-64,999",6.06,5.63,5.2,4.7699999999999996,4.34,3.9,3.47,2.61]
[10,"18.0-20.9","18.0-20.9 SEER",null,null,null,null,null,null,null,null,null,null,"18.0-20.9 SEER"]
[10,"18.0-20.9","Size (Btuh) Post","< 15,000","15,000-20,999","21,000-26,999","27,000-32,999","33,000-38,999","39,000-44,999","45,000-53,999","54,000-64,999",null,null,"Size (Btuh) Post","< 15,000","15,000-20,999","21,000-26,999","27,000-32,999","33,000-38,999","39,000-44,999","45,000-53,999","54,000-64,999"]
[10,"18.0-20.9","Size (Btuh) Pre",null,null,null,null,null,null,null,null,null,null,"Size (Btuh) Pre"]
[10,"18.0-20.9","< 15,000",1034,null,null,null,null,null,null,null,null,null,"< 15,000",0.56999999999999995]
[10,"18.0-20.9","15,000-20,999",2079,1551,null,null,null,null,null,null,null,null,"15,000-20,999",1.26,0.85]
[10,"18.0-20.9","21,000-26,999",3124,2596,2068,null,null,null,null,null,null,null,"21,000-26,999",1.95,1.55,1.1399999999999999]
[10,"18.0-20.9","27,000-32,999",4169,3641,3113,2585,null,null,null,null,null,null,"27,000-32,999",2.65,2.2400000000000002,1.83,1.42]
[10,"18.0-20.9","33,000-38,999",5214,4686,4158,3630,3102,null,null,null,null,null,"33,000-38,999",3.34,2.93,2.52,2.12,1.71]
[10,"18.0-20.9","39,000-44,999",6259,5731,5203,4675,4147,3619,null,null,null,null,"39,000-44,999",4.03,3.62,3.22,2.81,2.4,1.99]
[10,"18.0-20.9","45,000-53,999",7304,6776,6248,5720,5192,4664,4136,null,null,null,"45,000-53,999",4.7300000000000004,4.32,3.91,3.5,3.09,2.69,2.2799999999999998]
[10,"18.0-20.9","54,000-64,999",9395,8867,8338,7810,7282,6754,6226,5169,null,null,"54,000-64,999",6.11,5.7,5.3,4.8899999999999997,4.4800000000000004,4.07,3.66,2.85]
[10,"21.0-23.9","21.0-23.9 SEER",null,null,null,null,null,null,null,null,null,null,"21.0-23.9 SEER"]
[10,"21.0-23.9","Size (Btuh) Post","< 15,000","15,000-20,999","21,000-26,999","27,000-32,999","33,000-38,999","39,000-44,999","45,000-53,999","54,000-64,999",null,null,"Size (Btuh) Post","< 15,000","15,000-20,999","21,000-26,999","27,000-32,999","33,000-38,999","39,000-44,999","45,000-53,999","54,000-64,999"]
[10,"21.0-23.9","Size (Btuh) Pre",null,null,null,null,null,null,null,null,null,null,"Size (Btuh) Pre"]
[{"$f":"IFERROR(_xlfn.NUMBERVALUE(MID(C140,SEARCH(\"SEER Early\",C140)-6,5)),A139)","v":10},{"$f":"IF(C141=\"Size (Btuh) Post\",LEFT(C140,SEARCH(\"SEER\",C140)-2),B139)","v":"21.0-23.9"},"< 15,000",1179,null,null,null,null,null,null,null,null,null,"< 15,000",0.65]
[10,"21.0-23.9","15,000-20,999",2224,1769,null,null,null,null,null,null,null,null,"15,000-20,999",1.35,0.98]
[10,"21.0-23.9","21,000-26,999",3269,2814,2359,null,null,null,null,null,null,null,"21,000-26,999",2.04,1.67,1.31]
[10,"21.0-23.9","27,000-32,999",4315,3859,3404,2948,null,null,null,null,null,null,"27,000-32,999",2.73,2.37,2,1.64]
[10,"21.0-23.9","33,000-38,999",5360,4904,4449,3993,3538,null,null,null,null,null,"33,000-38,999",3.42,3.06,2.69,2.33,1.96]
[10,"21.0-23.9","39,000-44,999",6405,5949,5494,5038,4583,4127,null,null,null,null,"39,000-44,999",4.12,3.75,3.39,3.02,2.66,2.29]
[10,"21.0-23.9","45,000-53,999",7450,6994,6539,6083,5628,5173,4717,null,null,null,"45,000-53,999",4.8099999999999996,4.4400000000000004,4.08,3.71,3.35,2.98,2.62]
[10,"21.0-23.9","54,000-64,999",9540,9085,8629,8174,7718,7263,6807,5896,null,null,"54,000-64,999",6.2,5.83,5.46,5.0999999999999996,4.7300000000000004,4.37,4,3.27]
[10,"24.0+","24.0+ SEER",null,null,null,null,null,null,null,null,null,null,"24.0+ SEER"]
[10,"24.0+","Size (Btuh) Post","< 15,000","15,000-20,999","21,000-26,999","27,000-32,999","33,000-38,999","39,000-44,999","45,000-53,999","54,000-64,999",null,null,"Size (Btuh) Post","< 15,000","15,000-20,999","21,000-26,999","27,000-32,999","33,000-38,999","39,000-44,999","45,000-53,999","54,000-64,999"]
[10,"24.0+","Size (Btuh) Pre",null,null,null,null,null,null,null,null,null,null,"Size (Btuh) Pre"]
[10,"24.0+","< 15,000",1289,null,null,null,null,null,null,null,null,null,"< 15,000",0.72]
[10,"24.0+","15,000-20,999",2334,1934,null,null,null,null,null,null,null,null,"15,000-20,999",1.42,1.08]
[10,"24.0+","21,000-26,999",3379,2979,2579,null,null,null,null,null,null,null,"21,000-26,999",2.11,1.78,1.45]
[10,"24.0+","27,000-32,999",4425,4024,3624,3223,null,null,null,null,null,null,"27,000-32,999",2.8,2.4700000000000002,2.14,1.81]
[10,"24.0+","33,000-38,999",5470,5069,4669,4268,3868,null,null,null,null,null,"33,000-38,999",3.49,3.16,2.83,2.5,2.17]
[10,"24.0+","39,000-44,999",6515,6114,5714,5313,4913,4513,null,null,null,null,"39,000-44,999",4.1900000000000004,3.85,3.52,3.19,2.86,2.5299999999999998]
[10,"24.0+","45,000-53,999",7560,7159,6759,6359,5958,5558,5157,null,null,null,"45,000-53,999",4.88,4.55,4.22,3.89,3.55,3.22,2.89]
[10,"24.0+","54,000-64,999",9650,9250,8849,8449,8048,7648,7247,6446,null,null,"54,000-64,999",6.26,5.93,5.6,5.27,4.9400000000000004,4.6100000000000003,4.28,3.62]

{"sheet":"Heating NC ROB","index":8,"n_rows":180,"n_cols":22,"rows_kept":180,"cut":false,"hidden":true,"merged":[]}
["HSPF Range","Type"]
[null,null,"Table A‑25: Central Energy Savings (Heating kWh) for 8.2 HSPF Baseline—Zone 5",null,null,null,null,null,null,null,null,null,null,"Table A‑65: Central Winter Demand Savings for 8.2 HSPF Baseline—Zone 5"]
[{"$f":"IF(C4=\"Size (Btuh) Post\",LEFT(C3,SEARCH(\"HSPF\",C3)-2),A2)","v":"8.5-8.9"},"Central","8.5-8.9 HSPF",null,null,null,null,null,null,null,null,null,null,"8.5-8.9 HSPF"]
[{"$f":"IF(C5=\"Size (Btuh) Post\",LEFT(C4,SEARCH(\"HSPF\",C4)-2),A3)","v":"8.5-8.9"},"Central","Size (Btuh) Post","< 15,000","15,000-20,999","21,000-26,999","27,000-32,999","33,000-38,999","39,000-44,999","45,000-53,999","54,000-64,999",null,null,"Size (Btuh) Post","< 15,000","15,000-20,999","21,000-26,999","27,000-32,999","33,000-38,999","39,000-44,999","45,000-53,999","54,000-64,999"]
["8.5-8.9","Central","Size (Btuh) Pre",null,null,null,null,null,null,null,null,null,null,"Size (Btuh) Pre"]
["8.5-8.9","Central","< 15,000",81,null,null,null,null,null,null,null,null,null,"< 15,000",0.03]
["8.5-8.9","Central","15,000-20,999",667,122,null,null,null,null,null,null,null,null,"15,000-20,999",0.26,0.05]
["8.5-8.9","Central","21,000-26,999",1253,708,163,null,null,null,null,null,null,null,"21,000-26,999",0.49,0.28000000000000003,0.06]
["8.5-8.9","Central","27,000-32,999",1839,1294,749,203,null,null,null,null,null,null,"27,000-32,999",0.72,0.5,0.28999999999999998,0.08]
["8.5-8.9","Central","33,000-38,999",2425,1880,1334,789,244,null,null,null,null,null,"33,000-38,999",0.95,0.73,0.52,0.31,0.1]
["8.5-8.9","Central","39,000-44,999",3011,2465,1920,1375,830,285,null,null,null,null,"39,000-44,999",1.17,0.96,0.75,0.54,0.32,0.11]
["8.5-8.9","Central","45,000-53,999",3596,3051,2506,1961,1416,871,325,null,null,null,"45,000-53,999",1.4,1.19,0.98,0.77,0.55000000000000004,0.34,0.13]
["8.5-8.9","Central","54,000-64,999",4768,4223,3678,3133,2587,2042,1497,407,null,null,"54,000-64,999",1.86,1.65,1.43,1.22,1.01,0.8,0.57999999999999996,0.16]
["9.0-9.4","Central","9.0-9.4 HSPF",null,null,null,null,null,null,null,null,null,null,"9.0-9.4 HSPF"]
["9.0-9.4","Central","Size (Btuh) Post","< 15,000","15,000-20,999","21,000-26,999","27,000-32,999","33,000-38,999","39,000-44,999","45,000-53,999","54,000-64,999",null,null,"Size (Btuh) Post","< 15,000","15,000-20,999","21,000-26,999","27,000-32,999","33,000-38,999","39,000-44,999","45,000-53,999","54,000-64,999"]
["9.0-9.4","Central","Size (Btuh) Pre",null,null,null,null,null,null,null,null,null,null,"Size (Btuh) Pre"]
["9.0-9.4","Central","< 15,000",174,null,null,null,null,null,null,null,null,null,"< 15,000",7.0000000000000007E-2]
["9.0-9.4","Central","15,000-20,999",760,261,null,null,null,null,null,null,null,null,"15,000-20,999",0.3,0.1]
["9.0-9.4","Central","21,000-26,999",1345,846,348,null,null,null,null,null,null,null,"21,000-26,999",0.52,0.33,0.14000000000000001]
["9.0-9.4","Central","27,000-32,999",1931,1432,933,434,null,null,null,null,null,null,"27,000-32,999",0.75,0.56000000000000005,0.36,0.17]
["9.0-9.4","Central","33,000-38,999",2517,2018,1519,1020,521,null,null,null,null,null,"33,000-38,999",0.98,0.79,0.59,0.4,0.2]
["9.0-9.4","Central","39,000-44,999",3103,2604,2105,1606,1107,608,null,null,null,null,"39,000-44,999",1.21,1.02,0.82,0.63,0.43,0.24]
["9.0-9.4","Central","45,000-53,999",3689,3190,2691,2192,1693,1194,695,null,null,null,"45,000-53,999",1.44,1.24,1.05,0.86,0.66,0.47,0.27]
["9.0-9.4","Central","54,000-64,999",4861,4362,3863,3364,2865,2366,1867,869,null,null,"54,000-64,999",1.9,1.7,1.51,1.31,1.1200000000000001,0.92,0.73,0.34]
["9.5-9.9","Central","9.5-9.9 HSPF",null,null,null,null,null,null,null,null,null,null,"9.5-9.9 HSPF"]
["9.5-9.9","Central","Size (Btuh) Post","< 15,000","15,000-20,999","21,000-26,999","27,000-32,999","33,000-38,999","39,000-44,999","45,000-53,999","54,000-64,999",null,null,"Size (Btuh) Post","< 15,000","15,000-20,999","21,000-26,999","27,000-32,999","33,000-38,999","39,000-44,999","45,000-53,999","54,000-64,999"]
["9.5-9.9","Central","Size (Btuh) Pre",null,null,null,null,null,null,null,null,null,null,"Size (Btuh) Pre"]
[{"$f":"IF(C29=\"Size (Btuh) Post\",LEFT(C28,SEARCH(\"HSPF\",C28)-2),A27)","v":"9.5-9.9"},"Central","< 15,000",222,null,null,null,null,null,null,null,null,null,"< 15,000",0.09]
["9.5-9.9","Central","15,000-20,999",808,333,null,null,null,null,null,null,null,null,"15,000-20,999",0.32,0.13]
["9.5-9.9","Central","21,000-26,999",1393,918,443,null,null,null,null,null,null,null,"21,000-26,999",0.54,0.36,0.17]
["9.5-9.9","Central","27,000-32,999",1979,1504,1029,554,null,null,null,null,null,null,"27,000-32,999",0.77,0.59,0.4,0.22]
["9.5-9.9","Central","33,000-38,999",2565,2090,1615,1140,665,null,null,null,null,null,"33,000-38,999",1,0.82,0.63,0.44,0.26]
["9.5-9.9","Central","39,000-44,999",3151,2676,2201,1726,1251,776,null,null,null,null,"39,000-44,999",1.23,1.04,0.86,0.67,0.49,0.3]
["9.5-9.9","Central","45,000-53,999",3737,3262,2787,2312,1837,1362,887,null,null,null,"45,000-53,999",1.46,1.27,1.0900000000000001,0.9,0.72,0.53,0.35]
["9.5-9.9","Central","54,000-64,999",4908,4434,3959,3484,3009,2534,2059,1109,null,null,"54,000-64,999",1.92,1.73,1.54,1.36,1.17,0.99,0.8,0.43]
["10.0-10.4","Central","10.0-10.4 HSPF",null,null,null,null,null,null,null,null,null,null,"10.0-10.4 HSPF"]
["10.0-10.4","Central","Size (Btuh) Post","< 15,000","15,000-20,999","21,000-26,999","27,000-32,999","33,000-38,999","39,000-44,999","45,000-53,999","54,000-64,999",null,null,"Size (Btuh) Post","< 15,000","15,000-20,999","21,000-26,999","27,000-32,999","33,000-38,999","39,000-44,999","45,000-53,999","54,000-64,999"]
["10.0-10.4","Central","Size (Btuh) Pre",null,null,null,null,null,null,null,null,null,null,"Size (Btuh) Pre"]
["10.0-10.4","Central","< 15,000",240,null,null,null,null,null,null,null,null,null,"< 15,000",0.09]
["10.0-10.4","Central","15,000-20,999",826,360,null,null,null,null,null,null,null,null,"15,000-20,999",0.32,0.14000000000000001]
["10.0-10.4","Central","21,000-26,999",1411,946,480,null,null,null,null,null,null,null,"21,000-26,999",0.55000000000000004,0.37,0.19]
["10.0-10.4","Central","27,000-32,999",1997,1531,1065,599,null,null,null,null,null,null,"27,000-32,999",0.78,0.6,0.42,0.23]
["10.0-10.4","Central","33,000-38,999",2583,2117,1651,1185,719,null,null,null,null,null,"33,000-38,999",1.01,0.83,0.64,0.46,0.28000000000000003]
["10.0-10.4","Central","39,000-44,999",3169,2703,2237,1771,1305,839,null,null,null,null,"39,000-44,999",1.24,1.05,0.87,0.69,0.51,0.33]
["10.0-10.4","Central","45,000-53,999",3755,3289,2823,2357,1891,1425,959,null,null,null,"45,000-53,999",1.46,1.28,1.1000000000000001,0.92,0.74,0.56000000000000005,0.37]
["10.0-10.4","Central","54,000-64,999",4927,4461,3995,3529,3063,2597,2131,1199,null,null,"54,000-64,999",1.92,1.74,1.56,1.38,1.19,1.01,0.83,0.47]
["10.5-10.9","Central","10.5-10.9 HSPF",null,null,null,null,null,null,null,null,null,null,"10.5-10.9 HSPF"]
["10.5-10.9","Central","Size (Btuh) Post","< 15,000","15,000-20,999","21,000-26,999","27,000-32,999","33,000-38,999","39,000-44,999","45,000-53,999","54,000-64,999",null,null,"Size (Btuh) Post","< 15,000","15,000-20,999","21,000-26,999","27,000-32,999","33,000-38,999","39,000-44,999","45,000-53,999","54,000-64,999"]
["10.5-10.9","Central","Size (Btuh) Pre",null,null,null,null,null,null,null,null,null,null,"Size (Btuh) Pre"]
["10.5-10.9","Central","< 15,000",257,null,null,null,null,null,null,null,null,null,"< 15,000",0.1]
["10.5-10.9","Central","15,000-20,999",843,386,null,null,null,null,null,null,null,null,"15,000-20,999",0.33,0.15]
["10.5-10.9","Central","21,000-26,999",1429,972,514,null,null,null,null,null,null,null,"21,000-26,999",0.56000000000000005,0.38,0.2]
["10.5-10.9","Central","27,000-32,999",2015,1557,1100,643,null,null,null,null,null,null,"27,000-32,999",0.79,0.61,0.43,0.25]
["10.5-10.9","Central","33,000-38,999",2601,2143,1686,1229,771,null,null,null,null,null,"33,000-38,999",1.01,0.84,0.66,0.48,0.3]
["10.5-10.9","Central","39,000-44,999",3186,2729,2272,1815,1357,900,null,null,null,null,"39,000-44,999",1.24,1.06,0.89,0.71,0.53,0.35]
["10.5-10.9","Central","45,000-53,999",3772,3315,2858,2400,1943,1486,1029,null,null,null,"45,000-53,999",1.47,1.29,1.1100000000000001,0.94,0.76,0.57999999999999996,0.4]
["10.5-10.9","Central","54,000-64,999",4944,4487,4029,3572,3115,2658,2200,1286,null,null,"54,000-64,999",1.93,1.75,1.57,1.39,1.22,1.04,0.86,0.5]
["11.0-11.4","Central","11.0-11.4 HSPF",null,null,null,null,null,null,null,null,null,null,"11.0-11.4 HSPF"]
["11.0-11.4","Central","Size (Btuh) Post","< 15,000","15,000-20,999","21,000-26,999","27,000-32,999","33,000-38,999","39,000-44,999","45,000-53,999","54,000-64,999",null,null,"Size (Btuh) Post","< 15,000","15,000-20,999","21,000-26,999","27,000-32,999","33,000-38,999","39,000-44,999","45,000-53,999","54,000-64,999"]
["11.0-11.4","Central","Size (Btuh) Pre",null,null,null,null,null,null,null,null,null,null,"Size (Btuh) Pre"]
["11.0-11.4","Central","< 15,000",274,null,null,null,null,null,null,null,null,null,"< 15,000",0.11]
["11.0-11.4","Central","15,000-20,999",860,411,null,null,null,null,null,null,null,null,"15,000-20,999",0.34,0.16]
["11.0-11.4","Central","21,000-26,999",1446,997,548,null,null,null,null,null,null,null,"21,000-26,999",0.56000000000000005,0.39,0.21]
["11.0-11.4","Central","27,000-32,999",2031,1583,1134,685,null,null,null,null,null,null,"27,000-32,999",0.79,0.62,0.44,0.27]
["11.0-11.4","Central","33,000-38,999",2617,2168,1719,1271,822,null,null,null,null,null,"33,000-38,999",1.02,0.85,0.67,0.5,0.32]
["11.0-11.4","Central","39,000-44,999",3203,2754,2305,1856,1408,959,null,null,null,null,"39,000-44,999",1.25,1.07,0.9,0.72,0.55000000000000004,0.37]
["11.0-11.4","Central","45,000-53,999",3789,3340,2891,2442,1993,1544,1096,null,null,null,"45,000-53,999",1.48,1.3,1.1299999999999999,0.95,0.78,0.6,0.43]
["11.0-11.4","Central","54,000-64,999",4961,4512,4063,3614,3165,2716,2267,1369,null,null,"54,000-64,999",1.94,1.76,1.59,1.41,1.23,1.06,0.88,0.53]
["11.5-11.9","Central","11.5-11.9 HSPF",null,null,null,null,null,null,null,null,null,null,"11.5-11.9 HSPF"]
["11.5-11.9","Central","Size (Btuh) Post","< 15,000","15,000-20,999","21,000-26,999","27,000-32,999","33,000-38,999","39,000-44,999","45,000-53,999","54,000-64,999",null,null,"Size (Btuh) Post","< 15,000","15,000-20,999","21,000-26,999","27,000-32,999","33,000-38,999","39,000-44,999","45,000-53,999","54,000-64,999"]
["11.5-11.9","Central","Size (Btuh) Pre",null,null,null,null,null,null,null,null,null,null,"Size (Btuh) Pre"]
["11.5-11.9","Central","< 15,000",290,null,null,null,null,null,null,null,null,null,"< 15,000",0.11]
["11.5-11.9","Central","15,000-20,999",876,435,null,null,null,null,null,null,null,null,"15,000-20,999",0.34,0.17]
["11.5-11.9","Central","21,000-26,999",1462,1021,580,null,null,null,null,null,null,null,"21,000-26,999",0.56999999999999995,0.4,0.23]
["11.5-11.9","Central","27,000-32,999",2048,1607,1166,725,null,null,null,null,null,null,"27,000-32,999",0.8,0.63,0.45,0.28000000000000003]
["11.5-11.9","Central","33,000-38,999",2633,2193,1752,1311,870,null,null,null,null,null,"33,000-38,999",1.03,0.86,0.68,0.51,0.34]
["11.5-11.9","Central","39,000-44,999",3219,2778,2338,1897,1456,1015,null,null,null,null,"39,000-44,999",1.26,1.08,0.91,0.74,0.56999999999999995,0.4]
["11.5-11.9","Central","45,000-53,999",3805,3364,2923,2483,2042,1601,1160,null,null,null,"45,000-53,999",1.48,1.31,1.1399999999999999,0.97,0.8,0.62,0.45]
["11.5-11.9","Central","54,000-64,999",4977,4536,4095,3654,3213,2773,2332,1450,null,null,"54,000-64,999",1.94,1.77,1.6,1.43,1.25,1.08,0.91,0.56999999999999995]
["12.0+","Central","12.0+ HSPF",null,null,null,null,null,null,null,null,null,null,"12.0+ HSPF"]
["12.0+","Central","Size (Btuh) Post","< 15,000","15,000-20,999","21,000-26,999","27,000-32,999","33,000-38,999","39,000-44,999","45,000-53,999","54,000-64,999",null,null,"Size (Btuh) Post","< 15,000","15,000-20,999","21,000-26,999","27,000-32,999","33,000-38,999","39,000-44,999","45,000-53,999","54,000-64,999"]
["12.0+","Central","Size (Btuh) Pre",null,null,null,null,null,null,null,null,null,null,"Size (Btuh) Pre"]
["12.0+","Central","< 15,000",299,null,null,null,null,null,null,null,null,null,"< 15,000",0.12]
["12.0+","Central","15,000-20,999",885,449,null,null,null,null,null,null,null,null,"15,000-20,999",0.35,0.18]
["12.0+","Central","21,000-26,999",1471,1035,599,null,null,null,null,null,null,null,"21,000-26,999",0.56999999999999995,0.4,0.23]
["12.0+","Central","27,000-32,999",2057,1621,1185,749,null,null,null,null,null,null,"27,000-32,999",0.8,0.63,0.46,0.28999999999999998]
["12.0+","Central","33,000-38,999",2643,2207,1771,1334,898,null,null,null,null,null,"33,000-38,999",1.03,0.86,0.69,0.52,0.35]
["12.0+","Central","39,000-44,999",3229,2793,2356,1920,1484,1048,null,null,null,null,"39,000-44,999",1.26,1.0900000000000001,0.92,0.75,0.57999999999999996,0.41]
["12.0+","Central","45,000-53,999",3814,3378,2942,2506,2070,1634,1198,null,null,null,"45,000-53,999",1.49,1.32,1.1499999999999999,0.98,0.81,0.64,0.47]
["12.0+","Central","54,000-64,999",4986,4550,4114,3678,3242,2806,2369,1497,null,null,"54,000-64,999",1.95,1.78,1.61,1.43,1.26,1.0900000000000001,0.92,0.57999999999999996]
["12.0+","Central"]
[{"$f":"IF(C93=\"Size (Btuh) Post\",LEFT(C92,SEARCH(\"HSPF\",C92)-2),A91)","v":"12.0+"},"Mini Split","Table B‑5: Mini-Split Energy Savings (Heating kWh) for 8.2 HSPF Baseline—Zone 5",null,null,null,null,null,null,null,null,null,null,"Table B‑25: Mini-Split Winter Demand Savings for 8.2 HSPF Baseline—Zone 5"]
[{"$f":"IF(C94=\"Size (Btuh) Post\",LEFT(C93,SEARCH(\"HSPF\",C93)-2),A92)","v":"8.5-8.9"},"Mini Split","8.5-8.9 HSPF",null,null,null,null,null,null,null,null,null,null,"8.5-8.9 HSPF"]
["8.5-8.9","Mini Split","Size (Btuh) Post","< 15,000","15,000-20,999","21,000-26,999","27,000-32,999","33,000-38,999","39,000-44,999","45,000-53,999","54,000-64,999",null,null,"Size (Btuh) Post","< 15,000","15,000-20,999","21,000-26,999","27,000-32,999","33,000-38,999","39,000-44,999","45,000-53,999","54,000-64,999"]
["8.5-8.9","Mini Split","Size (Btuh) Pre",null,null,null,null,null,null,null,null,null,null,"Size (Btuh) Pre"]
["8.5-8.9","Mini Split","< 15,000",81,null,null,null,null,null,null,null,null,null,"< 15,000",0.03]
["8.5-8.9","Mini Split","15,000-20,999",667,122,null,null,null,null,null,null,null,null,"15,000-20,999",0.26,0.05]
["8.5-8.9","Mini Split","21,000-26,999",1253,708,163,null,null,null,null,null,null,null,"21,000-26,999",0.49,0.28000000000000003,0.06]
["8.5-8.9","Mini Split","27,000-32,999",1839,1294,749,203,null,null,null,null,null,null,"27,000-32,999",0.72,0.5,0.28999999999999998,0.08]
["8.5-8.9","Mini Split","33,000-38,999",2425,1880,1334,789,244,null,null,null,null,null,"33,000-38,999",0.95,0.73,0.52,0.31,0.1]
["8.5-8.9","Mini Split","39,000-44,999",3011,2465,1920,1375,830,285,null,null,null,null,"39,000-44,999",1.17,0.96,0.75,0.54,0.32,0.11]
["8.5-8.9","Mini Split","45,000-53,999",3596,3051,2506,1961,1416,871,325,null,null,null,"45,000-53,999",1.4,1.19,0.98,0.77,0.55000000000000004,0.34,0.13]
["8.5-8.9","Mini Split","54,000-64,999",4768,4223,3678,3133,2587,2042,1497,407,null,null,"54,000-64,999",1.86,1.65,1.43,1.22,1.01,0.8,0.57999999999999996,0.16]
["9.0-9.4","Mini Split","9.0-9.4 HSPF",null,null,null,null,null,null,null,null,null,null,"9.0-9.4 HSPF"]
["9.0-9.4","Mini Split","Size (Btuh) Post","< 15,000","15,000-20,999","21,000-26,999","27,000-32,999","33,000-38,999","39,000-44,999","45,000-53,999","54,000-64,999",null,null,"Size (Btuh) Post","< 15,000","15,000-20,999","21,000-26,999","27,000-32,999","33,000-38,999","39,000-44,999","45,000-53,999","54,000-64,999"]
["9.0-9.4","Mini Split","Size (Btuh) Pre",null,null,null,null,null,null,null,null,null,null,"Size (Btuh) Pre"]
["9.0-9.4","Mini Split","< 15,000",174,null,null,null,null,null,null,null,null,null,"< 15,000",7.0000000000000007E-2]
["9.0-9.4","Mini Split","15,000-20,999",760,261,null,null,null,null,null,null,null,null,"15,000-20,999",0.3,0.1]
["9.0-9.4","Mini Split","21,000-26,999",1345,846,348,null,null,null,null,null,null,null,"21,000-26,999",0.52,0.33,0.14000000000000001]
["9.0-9.4","Mini Split","27,000-32,999",1931,1432,933,434,null,null,null,null,null,null,"27,000-32,999",0.75,0.56000000000000005,0.36,0.17]
["9.0-9.4","Mini Split","33,000-38,999",2517,2018,1519,1020,521,null,null,null,null,null,"33,000-38,999",0.98,0.79,0.59,0.4,0.2]
["9.0-9.4","Mini Split","39,000-44,999",3103,2604,2105,1606,1107,608,null,null,null,null,"39,000-44,999",1.21,1.02,0.82,0.63,0.43,0.24]
["9.0-9.4","Mini Split","45,000-53,999",3689,3190,2691,2192,1693,1194,695,null,null,null,"45,000-53,999",1.44,1.24,1.05,0.86,0.66,0.47,0.27]
["9.0-9.4","Mini Split","54,000-64,999",4861,4362,3863,3364,2865,2366,1867,869,null,null,"54,000-64,999",1.9,1.7,1.51,1.31,1.1200000000000001,0.92,0.73,0.34]
["9.5-9.9","Mini Split","9.5-9.9 HSPF",null,null,null,null,null,null,null,null,null,null,"9.5-9.9 HSPF"]
["9.5-9.9","Mini Split","Size (Btuh) Post","< 15,000","15,000-20,999","21,000-26,999","27,000-32,999","33,000-38,999","39,000-44,999","45,000-53,999","54,000-64,999",null,null,"Size (Btuh) Post","< 15,000","15,000-20,999","21,000-26,999","27,000-32,999","33,000-38,999","39,000-44,999","45,000-53,999","54,000-64,999"]
["9.5-9.9","Mini Split","Size (Btuh) Pre",null,null,null,null,null,null,null,null,null,null,"Size (Btuh) Pre"]
["9.5-9.9","Mini Split","< 15,000",222,null,null,null,null,null,null,null,null,null,"< 15,000",0.09]
["9.5-9.9","Mini Split","15,000-20,999",808,333,null,null,null,null,null,null,null,null,"15,000-20,999",0.32,0.13]
["9.5-9.9","Mini Split","21,000-26,999",1393,918,443,null,null,null,null,null,null,null,"21,000-26,999",0.54,0.36,0.17]
["9.5-9.9","Mini Split","27,000-32,999",1979,1504,1029,554,null,null,null,null,null,null,"27,000-32,999",0.77,0.59,0.4,0.22]
["9.5-9.9","Mini Split","33,000-38,999",2565,2090,1615,1140,665,null,null,null,null,null,"33,000-38,999",1,0.82,0.63,0.44,0.26]
["9.5-9.9","Mini Split","39,000-44,999",3151,2676,2201,1726,1251,776,null,null,null,null,"39,000-44,999",1.23,1.04,0.86,0.67,0.49,0.3]
["9.5-9.9","Mini Split","45,000-53,999",3737,3262,2787,2312,1837,1362,887,null,null,null,"45,000-53,999",1.46,1.27,1.0900000000000001,0.9,0.72,0.53,0.35]
["9.5-9.9","Mini Split","54,000-64,999",4908,4434,3959,3484,3009,2534,2059,1109,null,null,"54,000-64,999",1.92,1.73,1.54,1.36,1.17,0.99,0.8,0.43]
["10.0-10.4","Mini Split","10.0-10.4 HSPF",null,null,null,null,null,null,null,null,null,null,"10.0-10.4 HSPF"]
["10.0-10.4","Mini Split","Size (Btuh) Post","< 15,000","15,000-20,999","21,000-26,999","27,000-32,999","33,000-38,999","39,000-44,999","45,000-53,999","54,000-64,999",null,null,"Size (Btuh) Post","< 15,000","15,000-20,999","21,000-26,999","27,000-32,999","33,000-38,999","39,000-44,999","45,000-53,999","54,000-64,999"]
["10.0-10.4","Mini Split","Size (Btuh) Pre",null,null,null,null,null,null,null,null,null,null,"Size (Btuh) Pre"]
["10.0-10.4","Mini Split","< 15,000",240,null,null,null,null,null,null,null,null,null,"< 15,000",0.09]
["10.0-10.4","Mini Split","15,000-20,999",826,360,null,null,null,null,null,null,null,null,"15,000-20,999",0.32,0.14000000000000001]
["10.0-10.4","Mini Split","21,000-26,999",1411,946,480,null,null,null,null,null,null,null,"21,000-26,999",0.55000000000000004,0.37,0.19]
["10.0-10.4","Mini Split","27,000-32,999",1997,1531,1065,599,null,null,null,null,null,null,"27,000-32,999",0.78,0.6,0.42,0.23]
["10.0-10.4","Mini Split","33,000-38,999",2583,2117,1651,1185,719,null,null,null,null,null,"33,000-38,999",1.01,0.83,0.64,0.46,0.28000000000000003]
["10.0-10.4","Mini Split","39,000-44,999",3169,2703,2237,1771,1305,839,null,null,null,null,"39,000-44,999",1.24,1.05,0.87,0.69,0.51,0.33]
["10.0-10.4","Mini Split","45,000-53,999",3755,3289,2823,2357,1891,1425,959,null,null,null,"45,000-53,999",1.46,1.28,1.1000000000000001,0.92,0.74,0.56000000000000005,0.37]
["10.0-10.4","Mini Split","54,000-64,999",4927,4461,3995,3529,3063,2597,2131,1199,null,null,"54,000-64,999",1.92,1.74,1.56,1.38,1.19,1.01,0.83,0.47]
["10.5-10.9","Mini Split","10.5-10.9 HSPF",null,null,null,null,null,null,null,null,null,null,"10.5-10.9 HSPF"]
["10.5-10.9","Mini Split","Size (Btuh) Post","< 15,000","15,000-20,999","21,000-26,999","27,000-32,999","33,000-38,999","39,000-44,999","45,000-53,999","54,000-64,999",null,null,"Size (Btuh) Post","< 15,000","15,000-20,999","21,000-26,999","27,000-32,999","33,000-38,999","39,000-44,999","45,000-53,999","54,000-64,999"]
["10.5-10.9","Mini Split","Size (Btuh) Pre",null,null,null,null,null,null,null,null,null,null,"Size (Btuh) Pre"]
["10.5-10.9","Mini Split","< 15,000",257,null,null,null,null,null,null,null,null,null,"< 15,000",0.1]
["10.5-10.9","Mini Split","15,000-20,999",843,386,null,null,null,null,null,null,null,null,"15,000-20,999",0.33,0.15]
["10.5-10.9","Mini Split","21,000-26,999",1429,972,514,null,null,null,null,null,null,null,"21,000-26,999",0.56000000000000005,0.38,0.2]
["10.5-10.9","Mini Split","27,000-32,999",2015,1557,1100,643,null,null,null,null,null,null,"27,000-32,999",0.79,0.61,0.43,0.25]
["10.5-10.9","Mini Split","33,000-38,999",2601,2143,1686,1229,771,null,null,null,null,null,"33,000-38,999",1.01,0.84,0.66,0.48,0.3]
["10.5-10.9","Mini Split","39,000-44,999",3186,2729,2272,1815,1357,900,null,null,null,null,"39,000-44,999",1.24,1.06,0.89,0.71,0.53,0.35]
["10.5-10.9","Mini Split","45,000-53,999",3772,3315,2858,2400,1943,1486,1029,null,null,null,"45,000-53,999",1.47,1.29,1.1100000000000001,0.94,0.76,0.57999999999999996,0.4]
["10.5-10.9","Mini Split","54,000-64,999",4944,4487,4029,3572,3115,2658,2200,1286,null,null,"54,000-64,999",1.93,1.75,1.57,1.39,1.22,1.04,0.86,0.5]
["11.0-11.4","Mini Split","11.0-11.4 HSPF",null,null,null,null,null,null,null,null,null,null,"11.0-11.4 HSPF"]
["11.0-11.4","Mini Split","Size (Btuh) Post","< 15,000","15,000-20,999","21,000-26,999","27,000-32,999","33,000-38,999","39,000-44,999","45,000-53,999","54,000-64,999",null,null,"Size (Btuh) Post","< 15,000","15,000-20,999","21,000-26,999","27,000-32,999","33,000-38,999","39,000-44,999","45,000-53,999","54,000-64,999"]
["11.0-11.4","Mini Split","Size (Btuh) Pre",null,null,null,null,null,null,null,null,null,null,"Size (Btuh) Pre"]
["11.0-11.4","Mini Split","< 15,000",274,null,null,null,null,null,null,null,null,null,"< 15,000",0.11]
["11.0-11.4","Mini Split","15,000-20,999",860,411,null,null,null,null,null,null,null,null,"15,000-20,999",0.34,0.16]
["11.0-11.4","Mini Split","21,000-26,999",1446,997,548,null,null,null,null,null,null,null,"21,000-26,999",0.56000000000000005,0.39,0.21]
["11.0-11.4","Mini Split","27,000-32,999",2031,1583,1134,685,null,null,null,null,null,null,"27,000-32,999",0.79,0.62,0.44,0.27]
["11.0-11.4","Mini Split","33,000-38,999",2617,2168,1719,1271,822,null,null,null,null,null,"33,000-38,999",1.02,0.85,0.67,0.5,0.32]
["11.0-11.4","Mini Split","39,000-44,999",3203,2754,2305,1856,1408,959,null,null,null,null,"39,000-44,999",1.25,1.07,0.9,0.72,0.55000000000000004,0.37]
[{"$f":"IF(C158=\"Size (Btuh) Post\",LEFT(C157,SEARCH(\"HSPF\",C157)-2),A156)","v":"11.0-11.4"},"Mini Split","45,000-53,999",3789,3340,2891,2442,1993,1544,1096,null,null,null,"45,000-53,999",1.48,1.3,1.1299999999999999,0.95,0.78,0.6,0.43]
["11.0-11.4","Mini Split","54,000-64,999",4961,4512,4063,3614,3165,2716,2267,1369,null,null,"54,000-64,999",1.94,1.76,1.59,1.41,1.23,1.06,0.88,0.53]
["11.5-11.9","Mini Split","11.5-11.9 HSPF",null,null,null,null,null,null,null,null,null,null,"11.5-11.9 HSPF"]
["11.5-11.9","Mini Split","Size (Btuh) Post","< 15,000","15,000-20,999","21,000-26,999","27,000-32,999","33,000-38,999","39,000-44,999","45,000-53,999","54,000-64,999",null,null,"Size (Btuh) Post","< 15,000","15,000-20,999","21,000-26,999","27,000-32,999","33,000-38,999","39,000-44,999","45,000-53,999","54,000-64,999"]
["11.5-11.9","Mini Split","Size (Btuh) Pre",null,null,null,null,null,null,null,null,null,null,"Size (Btuh) Pre"]
["11.5-11.9","Mini Split","< 15,000",290,null,null,null,null,null,null,null,null,null,"< 15,000",0.11]
["11.5-11.9","Mini Split","15,000-20,999",876,435,null,null,null,null,null,null,null,null,"15,000-20,999",0.34,0.17]
["11.5-11.9","Mini Split","21,000-26,999",1462,1021,580,null,null,null,null,null,null,null,"21,000-26,999",0.56999999999999995,0.4,0.23]
["11.5-11.9","Mini Split","27,000-32,999",2048,1607,1166,725,null,null,null,null,null,null,"27,000-32,999",0.8,0.63,0.45,0.28000000000000003]
["11.5-11.9","Mini Split","33,000-38,999",2633,2193,1752,1311,870,null,null,null,null,null,"33,000-38,999",1.03,0.86,0.68,0.51,0.34]
["11.5-11.9","Mini Split","39,000-44,999",3219,2778,2338,1897,1456,1015,null,null,null,null,"39,000-44,999",1.26,1.08,0.91,0.74,0.56999999999999995,0.4]
["11.5-11.9","Mini Split","45,000-53,999",3805,3364,2923,2483,2042,1601,1160,null,null,null,"45,000-53,999",1.48,1.31,1.1399999999999999,0.97,0.8,0.62,0.45]
["11.5-11.9","Mini Split","54,000-64,999",4977,4536,4095,3654,3213,2773,2332,1450,null,null,"54,000-64,999",1.94,1.77,1.6,1.43,1.25,1.08,0.91,0.56999999999999995]
["12.0+","Mini Split","12.0+ HSPF",null,null,null,null,null,null,null,null,null,null,"12.0+ HSPF"]
["12.0+","Mini Split","Size (Btuh) Post","< 15,000","15,000-20,999","21,000-26,999","27,000-32,999","33,000-38,999","39,000-44,999","45,000-53,999","54,000-64,999",null,null,"Size (Btuh) Post","< 15,000","15,000-20,999","21,000-26,999","27,000-32,999","33,000-38,999","39,000-44,999","45,000-53,999","54,000-64,999"]
["12.0+","Mini Split","Size (Btuh) Pre",null,null,null,null,null,null,null,null,null,null,"Size (Btuh) Pre"]
["12.0+","Mini Split","< 15,000",299,null,null,null,null,null,null,null,null,null,"< 15,000",0.12]
["12.0+","Mini Split","15,000-20,999",885,449,null,null,null,null,null,null,null,null,"15,000-20,999",0.35,0.18]
["12.0+","Mini Split","21,000-26,999",1471,1035,599,null,null,null,null,null,null,null,"21,000-26,999",0.56999999999999995,0.4,0.23]
["12.0+","Mini Split","27,000-32,999",2057,1621,1185,749,null,null,null,null,null,null,"27,000-32,999",0.8,0.63,0.46,0.28999999999999998]
["12.0+","Mini Split","33,000-38,999",2643,2207,1771,1334,898,null,null,null,null,null,"33,000-38,999",1.03,0.86,0.69,0.52,0.35]
["12.0+","Mini Split","39,000-44,999",3229,2793,2356,1920,1484,1048,null,null,null,null,"39,000-44,999",1.26,1.0900000000000001,0.92,0.75,0.57999999999999996,0.41]
["12.0+","Mini Split","45,000-53,999",3814,3378,2942,2506,2070,1634,1198,null,null,null,"45,000-53,999",1.49,1.32,1.1499999999999999,0.98,0.81,0.64,0.47]
["12.0+","Mini Split","54,000-64,999",4986,4550,4114,3678,3242,2806,2369,1497,null,null,"54,000-64,999",1.95,1.78,1.61,1.43,1.26,1.0900000000000001,0.92,0.57999999999999996]

{"sheet":"Heating ER","index":9,"n_rows":360,"n_cols":23,"rows_kept":360,"cut":false,"hidden":true,"merged":[]}
["Baseline HSPF","HSPF Range","Type"]
[{"$f":"IFERROR(_xlfn.NUMBERVALUE(MID(D2,SEARCH(\"HSPF Base\",D2)-4,3)),#REF!)","v":7.7},null,null,"Table A‑39: Central Energy Savings (Heating kWh) for 7.7 HSPF Baseline—Zone 5",null,null,null,null,null,null,null,null,null,null,"Table A‑79: Central Winter Demand Savings for 7.7 HSPF Baseline—Zone 5"]
[{"$f":"IFERROR(_xlfn.NUMBERVALUE(MID(D3,SEARCH(\"HSPF Base\",D3)-4,3)),A2)","v":7.7},{"$f":"IF(D4=\"Size (Btuh) Post\",LEFT(D3,SEARCH(\"HSPF\",D3)-2),B2)","v":"8.5-8.9"},"Central","8.5-8.9 HSPF",null,null,null,null,null,null,null,null,null,null,"8.5-8.9 HSPF"]
[7.7,"8.5-8.9","Central","Size (Btuh) Post","< 15,000","15,000-20,999","21,000-26,999","27,000-32,999","33,000-38,999","39,000-44,999","45,000-53,999","54,000-64,999",null,null,"Size (Btuh) Post","< 15,000","15,000-20,999","21,000-26,999","27,000-32,999","33,000-38,999","39,000-44,999","45,000-53,999","54,000-64,999"]
[7.7,"8.5-8.9","Central","Size (Btuh) Pre",null,null,null,null,null,null,null,null,null,null,"Size (Btuh) Pre"]
[7.7,"8.5-8.9","Central","< 15,000",197,null,null,null,null,null,null,null,null,null,"< 15,000",0.08]
[7.7,"8.5-8.9","Central","15,000-20,999",840,295,null,null,null,null,null,null,null,null,"15,000-20,999",0.33,0.12]
[7.7,"8.5-8.9","Central","21,000-26,999",1484,938,393,null,null,null,null,null,null,null,"21,000-26,999",0.57999999999999996,0.37,0.15]
[7.7,"8.5-8.9","Central","27,000-32,999",2127,1582,1037,492,null,null,null,null,null,null,"27,000-32,999",0.83,0.62,0.4,0.19]
[7.7,"8.5-8.9","Central","33,000-38,999",2770,2225,1680,1135,590,null,null,null,null,null,"33,000-38,999",1.08,0.87,0.66,0.44,0.23]
[7.7,"8.5-8.9","Central","39,000-44,999",3414,2869,2324,1778,1233,688,null,null,null,null,"39,000-44,999",1.33,1.1200000000000001,0.91,0.69,0.48,0.27]
[7.7,"8.5-8.9","Central","45,000-53,999",4057,3512,2967,2422,1877,1332,786,null,null,null,"45,000-53,999",1.58,1.37,1.1599999999999999,0.94,0.73,0.52,0.31]
[7.7,"8.5-8.9","Central","54,000-64,999",5344,4799,4254,3709,3164,2619,2073,983,null,null,"54,000-64,999",2.09,1.87,1.66,1.45,1.23,1.02,0.81,0.38]
[7.7,"9.0-9.4","Central","9.0-9.4 HSPF",null,null,null,null,null,null,null,null,null,null,"9.0-9.4 HSPF"]
[7.7,"9.0-9.4","Central","Size (Btuh) Post","< 15,000","15,000-20,999","21,000-26,999","27,000-32,999","33,000-38,999","39,000-44,999","45,000-53,999","54,000-64,999",null,null,"Size (Btuh) Post","< 15,000","15,000-20,999","21,000-26,999","27,000-32,999","33,000-38,999","39,000-44,999","45,000-53,999","54,000-64,999"]
[7.7,"9.0-9.4","Central","Size (Btuh) Pre",null,null,null,null,null,null,null,null,null,null,"Size (Btuh) Pre"]
[7.7,"9.0-9.4","Central","< 15,000",289,null,null,null,null,null,null,null,null,null,"< 15,000",0.11]
[7.7,"9.0-9.4","Central","15,000-20,999",932,434,null,null,null,null,null,null,null,null,"15,000-20,999",0.36,0.17]
[7.7,"9.0-9.4","Central","21,000-26,999",1576,1077,578,null,null,null,null,null,null,null,"21,000-26,999",0.61,0.42,0.23]
[7.7,"9.0-9.4","Central","27,000-32,999",2219,1720,1221,723,null,null,null,null,null,null,"27,000-32,999",0.87,0.67,0.48,0.28000000000000003]
[7.7,"9.0-9.4","Central","33,000-38,999",2863,2364,1865,1366,867,null,null,null,null,null,"33,000-38,999",1.1200000000000001,0.92,0.73,0.53,0.34]
[7.7,"9.0-9.4","Central","39,000-44,999",3506,3007,2508,2009,1511,1012,null,null,null,null,"39,000-44,999",1.37,1.17,0.98,0.78,0.59,0.39]
[7.7,"9.0-9.4","Central","45,000-53,999",4150,3651,3152,2653,2154,1655,1156,null,null,null,"45,000-53,999",1.62,1.42,1.23,1.04,0.84,0.65,0.45]
[7.7,"9.0-9.4","Central","54,000-64,999",5437,4938,4439,3940,3441,2942,2443,1445,null,null,"54,000-64,999",2.12,1.93,1.73,1.54,1.34,1.1499999999999999,0.95,0.56000000000000005]
[7.7,"9.5-9.9","Central","9.5-9.9 HSPF",null,null,null,null,null,null,null,null,null,null,"9.5-9.9 HSPF"]
[7.7,"9.5-9.9","Central","Size (Btuh) Post","< 15,000","15,000-20,999","21,000-26,999","27,000-32,999","33,000-38,999","39,000-44,999","45,000-53,999","54,000-64,999",null,null,"Size (Btuh) Post","< 15,000","15,000-20,999","21,000-26,999","27,000-32,999","33,000-38,999","39,000-44,999","45,000-53,999","54,000-64,999"]
[7.7,"9.5-9.9","Central","Size (Btuh) Pre",null,null,null,null,null,null,null,null,null,null,"Size (Btuh) Pre"]
[7.7,"9.5-9.9","Central","< 15,000",337,null,null,null,null,null,null,null,null,null,"< 15,000",0.13]
[7.7,"9.5-9.9","Central","15,000-20,999",980,505,null,null,null,null,null,null,null,null,"15,000-20,999",0.38,0.2]
[7.7,"9.5-9.9","Central","21,000-26,999",1624,1149,674,null,null,null,null,null,null,null,"21,000-26,999",0.63,0.45,0.26]
[7.7,"9.5-9.9","Central","27,000-32,999",2267,1792,1317,842,null,null,null,null,null,null,"27,000-32,999",0.88,0.7,0.51,0.33]
[7.7,"9.5-9.9","Central","33,000-38,999",2911,2436,1961,1486,1011,null,null,null,null,null,"33,000-38,999",1.1399999999999999,0.95,0.77,0.57999999999999996,0.39]
[7.7,"9.5-9.9","Central","39,000-44,999",3554,3079,2604,2129,1654,1179,null,null,null,null,"39,000-44,999",1.39,1.2,1.02,0.83,0.65,0.46]
[7.7,"9.5-9.9","Central","45,000-53,999",4198,3723,3248,2773,2298,1823,1348,null,null,null,"45,000-53,999",1.64,1.45,1.27,1.08,0.9,0.71,0.53]
[7.7,"9.5-9.9","Central","54,000-64,999",5485,5010,4535,4060,3585,3110,2635,1685,null,null,"54,000-64,999",2.14,1.95,1.77,1.58,1.4,1.21,1.03,0.66]
[7.7,"10.0-10.4","Central","10.0-10.4 HSPF",null,null,null,null,null,null,null,null,null,null,"10.0-10.4 HSPF"]
[7.7,"10.0-10.4","Central","Size (Btuh) Post","< 15,000","15,000-20,999","21,000-26,999","27,000-32,999","33,000-38,999","39,000-44,999","45,000-53,999","54,000-64,999",null,null,"Size (Btuh) Post","< 15,000","15,000-20,999","21,000-26,999","27,000-32,999","33,000-38,999","39,000-44,999","45,000-53,999","54,000-64,999"]
[7.7,"10.0-10.4","Central","Size (Btuh) Pre",null,null,null,null,null,null,null,null,null,null,"Size (Btuh) Pre"]
[7.7,"10.0-10.4","Central","< 15,000",355,null,null,null,null,null,null,null,null,null,"< 15,000",0.14000000000000001]
[7.7,"10.0-10.4","Central","15,000-20,999",999,533,null,null,null,null,null,null,null,null,"15,000-20,999",0.39,0.21]
[7.7,"10.0-10.4","Central","21,000-26,999",1642,1176,710,null,null,null,null,null,null,null,"21,000-26,999",0.64,0.46,0.28000000000000003]
[7.7,"10.0-10.4","Central","27,000-32,999",2285,1819,1354,888,null,null,null,null,null,null,"27,000-32,999",0.89,0.71,0.53,0.35]
[7.7,"10.0-10.4","Central","33,000-38,999",2929,2463,1997,1531,1065,null,null,null,null,null,"33,000-38,999",1.1399999999999999,0.96,0.78,0.6,0.42]
[7.7,"10.0-10.4","Central","39,000-44,999",3572,3106,2640,2175,1709,1243,null,null,null,null,"39,000-44,999",1.39,1.21,1.03,0.85,0.67,0.48]
[7.7,"10.0-10.4","Central","45,000-53,999",4216,3750,3284,2818,2352,1886,1420,null,null,null,"45,000-53,999",1.64,1.46,1.28,1.1000000000000001,0.92,0.74,0.55000000000000004]
[7.7,"10.0-10.4","Central","54,000-64,999",5503,5037,4571,4105,3639,3173,2707,1775,null,null,"54,000-64,999",2.15,1.97,1.78,1.6,1.42,1.24,1.06,0.69]
[7.7,"10.5-10.9","Central","10.5-10.9 HSPF",null,null,null,null,null,null,null,null,null,null,"10.5-10.9 HSPF"]
[7.7,"10.5-10.9","Central","Size (Btuh) Post","< 15,000","15,000-20,999","21,000-26,999","27,000-32,999","33,000-38,999","39,000-44,999","45,000-53,999","54,000-64,999",null,null,"Size (Btuh) Post","< 15,000","15,000-20,999","21,000-26,999","27,000-32,999","33,000-38,999","39,000-44,999","45,000-53,999","54,000-64,999"]
[7.7,"10.5-10.9","Central","Size (Btuh) Pre",null,null,null,null,null,null,null,null,null,null,"Size (Btuh) Pre"]
[7.7,"10.5-10.9","Central","< 15,000",372,null,null,null,null,null,null,null,null,null,"< 15,000",0.15]
[7.7,"10.5-10.9","Central","15,000-20,999",1016,559,null,null,null,null,null,null,null,null,"15,000-20,999",0.4,0.22]
[{"$f":"IFERROR(_xlfn.NUMBERVALUE(MID(D52,SEARCH(\"HSPF Base\",D52)-4,3)),A51)","v":7.7},{"$f":"IF(D53=\"Size (Btuh) Post\",LEFT(D52,SEARCH(\"HSPF\",D52)-2),B51)","v":"10.5-10.9"},"Central","21,000-26,999",1659,1202,745,null,null,null,null,null,null,null,"21,000-26,999",0.65,0.47,0.28999999999999998]
[7.7,"10.5-10.9","Central","27,000-32,999",2303,1846,1388,931,null,null,null,null,null,null,"27,000-32,999",0.9,0.72,0.54,0.36]
[7.7,"10.5-10.9","Central","33,000-38,999",2946,2489,2032,1574,1117,null,null,null,null,null,"33,000-38,999",1.1499999999999999,0.97,0.79,0.61,0.44]
[7.7,"10.5-10.9","Central","39,000-44,999",3590,3132,2675,2218,1761,1303,null,null,null,null,"39,000-44,999",1.4,1.22,1.04,0.87,0.69,0.51]
[7.7,"10.5-10.9","Central","45,000-53,999",4233,3776,3319,2861,2404,1947,1490,null,null,null,"45,000-53,999",1.65,1.47,1.29,1.1200000000000001,0.94,0.76,0.57999999999999996]
[7.7,"10.5-10.9","Central","54,000-64,999",5520,5063,4606,4148,3691,3234,2777,1862,null,null,"54,000-64,999",2.15,1.98,1.8,1.62,1.44,1.26,1.08,0.73]
[7.7,"11.0-11.4","Central","11.0-11.4 HSPF",null,null,null,null,null,null,null,null,null,null,"11.0-11.4 HSPF"]
[7.7,"11.0-11.4","Central","Size (Btuh) Post","< 15,000","15,000-20,999","21,000-26,999","27,000-32,999","33,000-38,999","39,000-44,999","45,000-53,999","54,000-64,999",null,null,"Size (Btuh) Post","< 15,000","15,000-20,999","21,000-26,999","27,000-32,999","33,000-38,999","39,000-44,999","45,000-53,999","54,000-64,999"]
[7.7,"11.0-11.4","Central","Size (Btuh) Pre",null,null,null,null,null,null,null,null,null,null,"Size (Btuh) Pre"]
[7.7,"11.0-11.4","Central","< 15,000",389,null,null,null,null,null,null,null,null,null,"< 15,000",0.15]
[7.7,"11.0-11.4","Central","15,000-20,999",1033,584,null,null,null,null,null,null,null,null,"15,000-20,999",0.4,0.23]
[7.7,"11.0-11.4","Central","21,000-26,999",1676,1227,778,null,null,null,null,null,null,null,"21,000-26,999",0.65,0.48,0.3]
[7.7,"11.0-11.4","Central","27,000-32,999",2320,1871,1422,973,null,null,null,null,null,null,"27,000-32,999",0.9,0.73,0.55000000000000004,0.38]
[7.7,"11.0-11.4","Central","33,000-38,999",2963,2514,2065,1616,1167,null,null,null,null,null,"33,000-38,999",1.1599999999999999,0.98,0.81,0.63,0.46]
[7.7,"11.0-11.4","Central","39,000-44,999",3606,3158,2709,2260,1811,1362,null,null,null,null,"39,000-44,999",1.41,1.23,1.06,0.88,0.71,0.53]
[7.7,"11.0-11.4","Central","45,000-53,999",4250,3801,3352,2903,2454,2005,1557,null,null,null,"45,000-53,999",1.66,1.48,1.31,1.1299999999999999,0.96,0.78,0.61]
[7.7,"11.0-11.4","Central","54,000-64,999",5537,5088,4639,4190,3741,3292,2844,1946,null,null,"54,000-64,999",2.16,1.99,1.81,1.63,1.46,1.28,1.1100000000000001,0.76]
[7.7,"11.5-11.9","Central","11.5-11.9 HSPF",null,null,null,null,null,null,null,null,null,null,"11.5-11.9 HSPF"]
[7.7,"11.5-11.9","Central","Size (Btuh) Post","< 15,000","15,000-20,999","21,000-26,999","27,000-32,999","33,000-38,999","39,000-44,999","45,000-53,999","54,000-64,999",null,null,"Size (Btuh) Post","< 15,000","15,000-20,999","21,000-26,999","27,000-32,999","33,000-38,999","39,000-44,999","45,000-53,999","54,000-64,999"]
[7.7,"11.5-11.9","Central","Size (Btuh) Pre",null,null,null,null,null,null,null,null,null,null,"Size (Btuh) Pre"]
[7.7,"11.5-11.9","Central","< 15,000",405,null,null,null,null,null,null,null,null,null,"< 15,000",0.16]
[7.7,"11.5-11.9","Central","15,000-20,999",1049,608,null,null,null,null,null,null,null,null,"15,000-20,999",0.41,0.24]
[7.7,"11.5-11.9","Central","21,000-26,999",1692,1251,811,null,null,null,null,null,null,null,"21,000-26,999",0.66,0.49,0.32]
[7.7,"11.5-11.9","Central","27,000-32,999",2336,1895,1454,1013,null,null,null,null,null,null,"27,000-32,999",0.91,0.74,0.56999999999999995,0.4]
[7.7,"11.5-11.9","Central","33,000-38,999",2979,2538,2097,1657,1216,null,null,null,null,null,"33,000-38,999",1.1599999999999999,0.99,0.82,0.65,0.47]
[7.7,"11.5-11.9","Central","39,000-44,999",3623,3182,2741,2300,1859,1418,null,null,null,null,"39,000-44,999",1.41,1.24,1.07,0.9,0.73,0.55000000000000004]
[7.7,"11.5-11.9","Central","45,000-53,999",4266,3825,3384,2944,2503,2062,1621,null,null,null,"45,000-53,999",1.66,1.49,1.32,1.1499999999999999,0.98,0.8,0.63]
[7.7,"11.5-11.9","Central","54,000-64,999",5553,5112,4671,4231,3790,3349,2908,2026,null,null,"54,000-64,999",2.17,1.99,1.82,1.65,1.48,1.31,1.1299999999999999,0.79]
[7.7,"12.0+","Central","12.0+ HSPF",null,null,null,null,null,null,null,null,null,null,"12.0+ HSPF"]
[7.7,"12.0+","Central","Size (Btuh) Post","< 15,000","15,000-20,999","21,000-26,999","27,000-32,999","33,000-38,999","39,000-44,999","45,000-53,999","54,000-64,999",null,null,"Size (Btuh) Post","< 15,000","15,000-20,999","21,000-26,999","27,000-32,999","33,000-38,999","39,000-44,999","45,000-53,999","54,000-64,999"]
[7.7,"12.0+","Central","Size (Btuh) Pre",null,null,null,null,null,null,null,null,null,null,"Size (Btuh) Pre"]
[7.7,"12.0+","Central","< 15,000",415,null,null,null,null,null,null,null,null,null,"< 15,000",0.16]
[7.7,"12.0+","Central","15,000-20,999",1058,622,null,null,null,null,null,null,null,null,"15,000-20,999",0.41,0.24]
[7.7,"12.0+","Central","21,000-26,999",1702,1265,829,null,null,null,null,null,null,null,"21,000-26,999",0.66,0.49,0.32]
[7.7,"12.0+","Central","27,000-32,999",2345,1909,1473,1037,null,null,null,null,null,null,"27,000-32,999",0.91,0.74,0.56999999999999995,0.4]
[7.7,"12.0+","Central","33,000-38,999",2989,2552,2116,1680,1244,null,null,null,null,null,"33,000-38,999",1.17,1,0.83,0.66,0.49]
[7.7,"12.0+","Central","39,000-44,999",3632,3196,2760,2324,1888,1451,null,null,null,null,"39,000-44,999",1.42,1.25,1.08,0.91,0.74,0.56999999999999995]
[7.7,"12.0+","Central","45,000-53,999",4275,3839,3403,2967,2531,2095,1659,null,null,null,"45,000-53,999",1.67,1.5,1.33,1.1599999999999999,0.99,0.82,0.65]
[7.7,"12.0+","Central","54,000-64,999",5562,5126,4690,4254,3818,3382,2946,2073,null,null,"54,000-64,999",2.17,2,1.83,1.66,1.49,1.32,1.1499999999999999,0.81]
[7.7,"12.0+","Central"]
[6.8,"12.0+","Central","Table A‑40: Central Energy Savings (Heating kWh) for 6.8 HSPF Baseline—Zone 5",null,null,null,null,null,null,null,null,null,null,"Table A‑80: Central Winter Demand Savings for 6.8 HSPF Baseline—Zone 5"]
[6.8,"8.5-8.9","Central","8.5-8.9 HSPF",null,null,null,null,null,null,null,null,null,null,"8.5-8.9 HSPF"]
[6.8,"8.5-8.9","Central","Size (Btuh) Post","< 15,000","15,000-20,999","21,000-26,999","27,000-32,999","33,000-38,999","39,000-44,999","45,000-53,999","54,000-64,999",null,null,"Size (Btuh) Post","< 15,000","15,000-20,999","21,000-26,999","27,000-32,999","33,000-38,999","39,000-44,999","45,000-53,999","54,000-64,999"]
[6.8,"8.5-8.9","Central","Size (Btuh) Pre",null,null,null,null,null,null,null,null,null,null,"Size (Btuh) Pre"]
[6.8,"8.5-8.9","Central","< 15,000",473,null,null,null,null,null,null,null,null,null,"< 15,000",0.18]
[6.8,"8.5-8.9","Central","15,000-20,999",1255,710,null,null,null,null,null,null,null,null,"15,000-20,999",0.49,0.28000000000000003]
[6.8,"8.5-8.9","Central","21,000-26,999",2037,1492,947,null,null,null,null,null,null,null,"21,000-26,999",0.79,0.57999999999999996,0.37]
[6.8,"8.5-8.9","Central","27,000-32,999",2819,2274,1729,1184,null,null,null,null,null,null,"27,000-32,999",1.1000000000000001,0.89,0.67,0.46]
[6.8,"8.5-8.9","Central","33,000-38,999",3601,3056,2511,1966,1420,null,null,null,null,null,"33,000-38,999",1.4,1.19,0.98,0.77,0.55000000000000004]
[6.8,"8.5-8.9","Central","39,000-44,999",4383,3838,3293,2748,2202,1657,null,null,null,null,"39,000-44,999",1.71,1.5,1.28,1.07,0.86,0.65]
[6.8,"8.5-8.9","Central","45,000-53,999",5165,4620,4075,3529,2984,2439,1894,null,null,null,"45,000-53,999",2.02,1.8,1.59,1.38,1.1599999999999999,0.95,0.74]
[6.8,"8.5-8.9","Central","54,000-64,999",6729,6184,5638,5093,4548,4003,3458,2367,null,null,"54,000-64,999",2.63,2.41,2.2000000000000002,1.99,1.77,1.56,1.35,0.92]
[6.8,"9.0-9.4","Central","9.0-9.4 HSPF",null,null,null,null,null,null,null,null,null,null,"9.0-9.4 HSPF"]
[6.8,"9.0-9.4","Central","Size (Btuh) Post","< 15,000","15,000-20,999","21,000-26,999","27,000-32,999","33,000-38,999","39,000-44,999","45,000-53,999","54,000-64,999",null,null,"Size (Btuh) Post","< 15,000","15,000-20,999","21,000-26,999","27,000-32,999","33,000-38,999","39,000-44,999","45,000-53,999","54,000-64,999"]
[6.8,"9.0-9.4","Central","Size (Btuh) Pre",null,null,null,null,null,null,null,null,null,null,"Size (Btuh) Pre"]
[6.8,"9.0-9.4","Central","< 15,000",566,null,null,null,null,null,null,null,null,null,"< 15,000",0.22]
[6.8,"9.0-9.4","Central","15,000-20,999",1348,849,null,null,null,null,null,null,null,null,"15,000-20,999",0.53,0.33]
[6.8,"9.0-9.4","Central","21,000-26,999",2130,1631,1132,null,null,null,null,null,null,null,"21,000-26,999",0.83,0.64,0.44]
[6.8,"9.0-9.4","Central","27,000-32,999",2912,2413,1914,1415,null,null,null,null,null,null,"27,000-32,999",1.1399999999999999,0.94,0.75,0.55000000000000004]
[6.8,"9.0-9.4","Central","33,000-38,999",3693,3195,2696,2197,1698,null,null,null,null,null,"33,000-38,999",1.44,1.25,1.05,0.86,0.66]
[6.8,"9.0-9.4","Central","39,000-44,999",4475,3976,3477,2979,2480,1981,null,null,null,null,"39,000-44,999",1.75,1.55,1.36,1.1599999999999999,0.97,0.77]
[6.8,"9.0-9.4","Central","45,000-53,999",5257,4758,4259,3760,3261,2763,2264,null,null,null,"45,000-53,999",2.0499999999999998,1.86,1.66,1.47,1.27,1.08,0.88]
[6.8,"9.0-9.4","Central","54,000-64,999",6821,6322,5823,5324,4825,4326,3827,2829,null,null,"54,000-64,999",2.66,2.4700000000000002,2.27,2.08,1.88,1.69,1.49,1.1000000000000001]
[6.8,"9.5-9.9","Central","9.5-9.9 HSPF",null,null,null,null,null,null,null,null,null,null,"9.5-9.9 HSPF"]
[{"$f":"IFERROR(_xlfn.NUMBERVALUE(MID(D116,SEARCH(\"HSPF Base\",D116)-4,3)),A115)","v":6.8},{"$f":"IF(D117=\"Size (Btuh) Post\",LEFT(D116,SEARCH(\"HSPF\",D116)-2),B115)","v":"9.5-9.9"},"Central","Size (Btuh) Post","< 15,000","15,000-20,999","21,000-26,999","27,000-32,999","33,000-38,999","39,000-44,999","45,000-53,999","54,000-64,999",null,null,"Size (Btuh) Post","< 15,000","15,000-20,999","21,000-26,999","27,000-32,999","33,000-38,999","39,000-44,999","45,000-53,999","54,000-64,999"]
[6.8,"9.5-9.9","Central","Size (Btuh) Pre",null,null,null,null,null,null,null,null,null,null,"Size (Btuh) Pre"]
[6.8,"9.5-9.9","Central","< 15,000",614,null,null,null,null,null,null,null,null,null,"< 15,000",0.24]
[6.8,"9.5-9.9","Central","15,000-20,999",1396,921,null,null,null,null,null,null,null,null,"15,000-20,999",0.54,0.36]
[6.8,"9.5-9.9","Central","21,000-26,999",2178,1703,1228,null,null,null,null,null,null,null,"21,000-26,999",0.85,0.66,0.48]
[6.8,"9.5-9.9","Central","27,000-32,999",2960,2485,2010,1535,null,null,null,null,null,null,"27,000-32,999",1.1499999999999999,0.97,0.78,0.6]
[6.8,"9.5-9.9","Central","33,000-38,999",3741,3267,2792,2317,1842,null,null,null,null,null,"33,000-38,999",1.46,1.27,1.0900000000000001,0.9,0.72]
[6.8,"9.5-9.9","Central","39,000-44,999",4523,4048,3573,3098,2624,2149,null,null,null,null,"39,000-44,999",1.76,1.58,1.39,1.21,1.02,0.84]
[6.8,"9.5-9.9","Central","45,000-53,999",5305,4830,4355,3880,3405,2930,2455,null,null,null,"45,000-53,999",2.0699999999999998,1.88,1.7,1.51,1.33,1.1399999999999999,0.96]
[6.8,"9.5-9.9","Central","54,000-64,999",6869,6394,5919,5444,4969,4494,4019,3069,null,null,"54,000-64,999",2.68,2.4900000000000002,2.31,2.12,1.94,1.75,1.57,1.2]
[6.8,"10.0-10.4","Central","10.0-10.4 HSPF",null,null,null,null,null,null,null,null,null,null,"10.0-10.4 HSPF"]
[6.8,"10.0-10.4","Central","Size (Btuh) Post","< 15,000","15,000-20,999","21,000-26,999","27,000-32,999","33,000-38,999","39,000-44,999","45,000-53,999","54,000-64,999",null,null,"Size (Btuh) Post","< 15,000","15,000-20,999","21,000-26,999","27,000-32,999","33,000-38,999","39,000-44,999","45,000-53,999","54,000-64,999"]
[6.8,"10.0-10.4","Central","Size (Btuh) Pre",null,null,null,null,null,null,null,null,null,null,"Size (Btuh) Pre"]
[6.8,"10.0-10.4","Central","< 15,000",632,null,null,null,null,null,null,null,null,null,"< 15,000",0.25]
[6.8,"10.0-10.4","Central","15,000-20,999",1414,948,null,null,null,null,null,null,null,null,"15,000-20,999",0.55000000000000004,0.37]
[6.8,"10.0-10.4","Central","21,000-26,999",2196,1730,1264,null,null,null,null,null,null,null,"21,000-26,999",0.86,0.67,0.49]
[6.8,"10.0-10.4","Central","27,000-32,999",2978,2512,2046,1580,null,null,null,null,null,null,"27,000-32,999",1.1599999999999999,0.98,0.8,0.62]
[6.8,"10.0-10.4","Central","33,000-38,999",3760,3294,2828,2362,1896,null,null,null,null,null,"33,000-38,999",1.47,1.28,1.1000000000000001,0.92,0.74]
[6.8,"10.0-10.4","Central","39,000-44,999",4541,4075,3610,3144,2678,2212,null,null,null,null,"39,000-44,999",1.77,1.59,1.41,1.23,1.04,0.86]
[6.8,"10.0-10.4","Central","45,000-53,999",5323,4857,4391,3925,3460,2994,2528,null,null,null,"45,000-53,999",2.08,1.9,1.71,1.53,1.35,1.17,0.99]
[6.8,"10.0-10.4","Central","54,000-64,999",6887,6421,5955,5489,5023,4557,4091,3160,null,null,"54,000-64,999",2.69,2.5099999999999998,2.3199999999999998,2.14,1.96,1.78,1.6,1.23]
[6.8,"10.5-10.9","Central","10.5-10.9 HSPF",null,null,null,null,null,null,null,null,null,null,"10.5-10.9 HSPF"]
[6.8,"10.5-10.9","Central","Size (Btuh) Post","< 15,000","15,000-20,999","21,000-26,999","27,000-32,999","33,000-38,999","39,000-44,999","45,000-53,999","54,000-64,999",null,null,"Size (Btuh) Post","< 15,000","15,000-20,999","21,000-26,999","27,000-32,999","33,000-38,999","39,000-44,999","45,000-53,999","54,000-64,999"]
[6.8,"10.5-10.9","Central","Size (Btuh) Pre",null,null,null,null,null,null,null,null,null,null,"Size (Btuh) Pre"]
[6.8,"10.5-10.9","Central","< 15,000",649,null,null,null,null,null,null,null,null,null,"< 15,000",0.25]
[6.8,"10.5-10.9","Central","15,000-20,999",1431,974,null,null,null,null,null,null,null,null,"15,000-20,999",0.56000000000000005,0.38]
[6.8,"10.5-10.9","Central","21,000-26,999",2213,1756,1299,null,null,null,null,null,null,null,"21,000-26,999",0.86,0.69,0.51]
[6.8,"10.5-10.9","Central","27,000-32,999",2995,2538,2080,1623,null,null,null,null,null,null,"27,000-32,999",1.17,0.99,0.81,0.63]
[6.8,"10.5-10.9","Central","33,000-38,999",3777,3320,2862,2405,1948,null,null,null,null,null,"33,000-38,999",1.47,1.3,1.1200000000000001,0.94,0.76]
[6.8,"10.5-10.9","Central","39,000-44,999",4559,4102,3644,3187,2730,2272,null,null,null,null,"39,000-44,999",1.78,1.6,1.42,1.24,1.06,0.89]
[6.8,"10.5-10.9","Central","45,000-53,999",5341,4883,4426,3969,3512,3054,2597,null,null,null,"45,000-53,999",2.08,1.91,1.73,1.55,1.37,1.19,1.01]
[6.8,"10.5-10.9","Central","54,000-64,999",6905,6447,5990,5533,5075,4618,4161,3246,null,null,"54,000-64,999",2.69,2.52,2.34,2.16,1.98,1.8,1.62,1.27]
[6.8,"11.0-11.4","Central","11.0-11.4 HSPF",null,null,null,null,null,null,null,null,null,null,"11.0-11.4 HSPF"]
[6.8,"11.0-11.4","Central","Size (Btuh) Post","< 15,000","15,000-20,999","21,000-26,999","27,000-32,999","33,000-38,999","39,000-44,999","45,000-53,999","54,000-64,999",null,null,"Size (Btuh) Post","< 15,000","15,000-20,999","21,000-26,999","27,000-32,999","33,000-38,999","39,000-44,999","45,000-53,999","54,000-64,999"]
[6.8,"11.0-11.4","Central","Size (Btuh) Pre",null,null,null,null,null,null,null,null,null,null,"Size (Btuh) Pre"]
[6.8,"11.0-11.4","Central","< 15,000",666,null,null,null,null,null,null,null,null,null,"< 15,000",0.26]
[6.8,"11.0-11.4","Central","15,000-20,999",1448,999,null,null,null,null,null,null,null,null,"15,000-20,999",0.56000000000000005,0.39]
[6.8,"11.0-11.4","Central","21,000-26,999",2230,1781,1332,null,null,null,null,null,null,null,"21,000-26,999",0.87,0.69,0.52]
[6.8,"11.0-11.4","Central","27,000-32,999",3012,2563,2114,1665,null,null,null,null,null,null,"27,000-32,999",1.18,1,0.82,0.65]
[6.8,"11.0-11.4","Central","33,000-38,999",3794,3345,2896,2447,1998,null,null,null,null,null,"33,000-38,999",1.48,1.3,1.1299999999999999,0.95,0.78]
[6.8,"11.0-11.4","Central","39,000-44,999",4576,4127,3678,3229,2780,2331,null,null,null,null,"39,000-44,999",1.79,1.61,1.43,1.26,1.08,0.91]
[6.8,"11.0-11.4","Central","45,000-53,999",5357,4909,4460,4011,3562,3113,2664,null,null,null,"45,000-53,999",2.09,1.92,1.74,1.56,1.39,1.21,1.04]
[6.8,"11.0-11.4","Central","54,000-64,999",6921,6472,6023,5575,5126,4677,4228,3330,null,null,"54,000-64,999",2.7,2.5299999999999998,2.35,2.17,2,1.82,1.65,1.3]
[6.8,"11.5-11.9","Central","11.5-11.9 HSPF",null,null,null,null,null,null,null,null,null,null,"11.5-11.9 HSPF"]
[6.8,"11.5-11.9","Central","Size (Btuh) Post","< 15,000","15,000-20,999","21,000-26,999","27,000-32,999","33,000-38,999","39,000-44,999","45,000-53,999","54,000-64,999",null,null,"Size (Btuh) Post","< 15,000","15,000-20,999","21,000-26,999","27,000-32,999","33,000-38,999","39,000-44,999","45,000-53,999","54,000-64,999"]
[6.8,"11.5-11.9","Central","Size (Btuh) Pre",null,null,null,null,null,null,null,null,null,null,"Size (Btuh) Pre"]
[6.8,"11.5-11.9","Central","< 15,000",682,null,null,null,null,null,null,null,null,null,"< 15,000",0.27]
[6.8,"11.5-11.9","Central","15,000-20,999",1464,1023,null,null,null,null,null,null,null,null,"15,000-20,999",0.56999999999999995,0.4]
[6.8,"11.5-11.9","Central","21,000-26,999",2246,1805,1364,null,null,null,null,null,null,null,"21,000-26,999",0.88,0.7,0.53]
[6.8,"11.5-11.9","Central","27,000-32,999",3028,2587,2146,1705,null,null,null,null,null,null,"27,000-32,999",1.18,1.01,0.84,0.67]
[6.8,"11.5-11.9","Central","33,000-38,999",3810,3369,2928,2487,2046,null,null,null,null,null,"33,000-38,999",1.49,1.31,1.1399999999999999,0.97,0.8]
[6.8,"11.5-11.9","Central","39,000-44,999",4592,4151,3710,3269,2828,2388,null,null,null,null,"39,000-44,999",1.79,1.62,1.45,1.28,1.1000000000000001,0.93]
[6.8,"11.5-11.9","Central","45,000-53,999",5374,4933,4492,4051,3610,3169,2729,null,null,null,"45,000-53,999",2.1,1.92,1.75,1.58,1.41,1.24,1.06]
[6.8,"11.5-11.9","Central","54,000-64,999",6937,6497,6056,5615,5174,4733,4292,3411,null,null,"54,000-64,999",2.71,2.5299999999999998,2.36,2.19,2.02,1.85,1.67,1.33]
[6.8,"12.0+","Central","12.0+ HSPF",null,null,null,null,null,null,null,null,null,null,"12.0+ HSPF"]
[6.8,"12.0+","Central","Size (Btuh) Post","< 15,000","15,000-20,999","21,000-26,999","27,000-32,999","33,000-38,999","39,000-44,999","45,000-53,999","54,000-64,999",null,null,"Size (Btuh) Post","< 15,000","15,000-20,999","21,000-26,999","27,000-32,999","33,000-38,999","39,000-44,999","45,000-53,999","54,000-64,999"]
[6.8,"12.0+","Central","Size (Btuh) Pre",null,null,null,null,null,null,null,null,null,null,"Size (Btuh) Pre"]
[6.8,"12.0+","Central","< 15,000",692,null,null,null,null,null,null,null,null,null,"< 15,000",0.27]
[6.8,"12.0+","Central","15,000-20,999",1473,1037,null,null,null,null,null,null,null,null,"15,000-20,999",0.56999999999999995,0.4]
[6.8,"12.0+","Central","21,000-26,999",2255,1819,1383,null,null,null,null,null,null,null,"21,000-26,999",0.88,0.71,0.54]
[6.8,"12.0+","Central","27,000-32,999",3037,2601,2165,1729,null,null,null,null,null,null,"27,000-32,999",1.18,1.01,0.84,0.67]
[6.8,"12.0+","Central","33,000-38,999",3819,3383,2947,2511,2075,null,null,null,null,null,"33,000-38,999",1.49,1.32,1.1499999999999999,0.98,0.81]
[6.8,"12.0+","Central","39,000-44,999",4601,4165,3729,3293,2857,2420,null,null,null,null,"39,000-44,999",1.8,1.62,1.45,1.28,1.1100000000000001,0.94]
[6.8,"12.0+","Central","45,000-53,999",5383,4947,4511,4075,3638,3202,2766,null,null,null,"45,000-53,999",2.1,1.93,1.76,1.59,1.42,1.25,1.08]
[{"$f":"IFERROR(_xlfn.NUMBERVALUE(MID(D180,SEARCH(\"HSPF Base\",D180)-4,3)),A179)","v":6.8},{"$f":"IF(D181=\"Size (Btuh) Post\",LEFT(D180,SEARCH(\"HSPF\",D180)-2),B179)","v":"12.0+"},"Central","54,000-64,999",6947,6511,6075,5638,5202,4766,4330,3458,null,null,"54,000-64,999",2.71,2.54,2.37,2.2000000000000002,2.0299999999999998,1.86,1.69,1.35]
[{"$f":"IFERROR(_xlfn.NUMBERVALUE(MID(D181,SEARCH(\"HSPF Base\",D181)-4,3)),A180)","v":6.8},{"$f":"IF(D182=\"Size (Btuh) Post\",LEFT(D181,SEARCH(\"HSPF\",D181)-2),B180)","v":"12.0+"}]
[7.7,"12.0+","Mini Split","Table B‑19: Mini-Split Energy Savings (Heating kWh) for 7.7 HSPF Baseline—Zone 5",null,null,null,null,null,null,null,null,null,null,"Table B‑39: Mini-Split Winter Demand Savings for 7.7 HSPF Baseline—Zone 5"]
[7.7,"8.5-8.9","Mini Split","8.5-8.9 HSPF",null,null,null,null,null,null,null,null,null,null,"8.5-8.9 HSPF"]
[{"$f":"IFERROR(_xlfn.NUMBERVALUE(MID(D184,SEARCH(\"HSPF Base\",D184)-4,3)),A183)","v":7.7},{"$f":"IF(D185=\"Size (Btuh) Post\",LEFT(D184,SEARCH(\"HSPF\",D184)-2),B183)","v":"8.5-8.9"},"Mini Split","Size (Btuh) Post","< 15,000","15,000-20,999","21,000-26,999","27,000-32,999","33,000-38,999","39,000-44,999","45,000-53,999","54,000-64,999",null,null,"Size (Btuh) Post","< 15,000","15,000-20,999","21,000-26,999","27,000-32,999","33,000-38,999","39,000-44,999","45,000-53,999","54,000-64,999"]
[7.7,"8.5-8.9","Mini Split","Size (Btuh) Pre",null,null,null,null,null,null,null,null,null,null,"Size (Btuh) Pre"]
[7.7,"8.5-8.9","Mini Split","< 15,000",197,null,null,null,null,null,null,null,null,null,"< 15,000",0.08]
[7.7,"8.5-8.9","Mini Split","15,000-20,999",840,295,null,null,null,null,null,null,null,null,"15,000-20,999",0.33,0.12]
[7.7,"8.5-8.9","Mini Split","21,000-26,999",1484,938,393,null,null,null,null,null,null,null,"21,000-26,999",0.57999999999999996,0.37,0.15]
[7.7,"8.5-8.9","Mini Split","27,000-32,999",2127,1582,1037,492,null,null,null,null,null,null,"27,000-32,999",0.83,0.62,0.4,0.19]
[7.7,"8.5-8.9","Mini Split","33,000-38,999",2770,2225,1680,1135,590,null,null,null,null,null,"33,000-38,999",1.08,0.87,0.66,0.44,0.23]
[7.7,"8.5-8.9","Mini Split","39,000-44,999",3414,2869,2324,1778,1233,688,null,null,null,null,"39,000-44,999",1.33,1.1200000000000001,0.91,0.69,0.48,0.27]
[7.7,"8.5-8.9","Mini Split","45,000-53,999",4057,3512,2967,2422,1877,1332,786,null,null,null,"45,000-53,999",1.58,1.37,1.1599999999999999,0.94,0.73,0.52,0.31]
[7.7,"8.5-8.9","Mini Split","54,000-64,999",5344,4799,4254,3709,3164,2619,2073,983,null,null,"54,000-64,999",2.09,1.87,1.66,1.45,1.23,1.02,0.81,0.38]
[7.7,"9.0-9.4","Mini Split","9.0-9.4 HSPF",null,null,null,null,null,null,null,null,null,null,"9.0-9.4 HSPF"]
[7.7,"9.0-9.4","Mini Split","Size (Btuh) Post","< 15,000","15,000-20,999","21,000-26,999","27,000-32,999","33,000-38,999","39,000-44,999","45,000-53,999","54,000-64,999",null,null,"Size (Btuh) Post","< 15,000","15,000-20,999","21,000-26,999","27,000-32,999","33,000-38,999","39,000-44,999","45,000-53,999","54,000-64,999"]
[7.7,"9.0-9.4","Mini Split","Size (Btuh) Pre",null,null,null,null,null,null,null,null,null,null,"Size (Btuh) Pre"]
[7.7,"9.0-9.4","Mini Split","< 15,000",289,null,null,null,null,null,null,null,null,null,"< 15,000",0.11]
[7.7,"9.0-9.4","Mini Split","15,000-20,999",932,434,null,null,null,null,null,null,null,null,"15,000-20,999",0.36,0.17]
[7.7,"9.0-9.4","Mini Split","21,000-26,999",1576,1077,578,null,null,null,null,null,null,null,"21,000-26,999",0.61,0.42,0.23]
[7.7,"9.0-9.4","Mini Split","27,000-32,999",2219,1720,1221,723,null,null,null,null,null,null,"27,000-32,999",0.87,0.67,0.48,0.28000000000000003]
[7.7,"9.0-9.4","Mini Split","33,000-38,999",2863,2364,1865,1366,867,null,null,null,null,null,"33,000-38,999",1.1200000000000001,0.92,0.73,0.53,0.34]
[7.7,"9.0-9.4","Mini Split","39,000-44,999",3506,3007,2508,2009,1511,1012,null,null,null,null,"39,000-44,999",1.37,1.17,0.98,0.78,0.59,0.39]
[7.7,"9.0-9.4","Mini Split","45,000-53,999",4150,3651,3152,2653,2154,1655,1156,null,null,null,"45,000-53,999",1.62,1.42,1.23,1.04,0.84,0.65,0.45]
[7.7,"9.0-9.4","Mini Split","54,000-64,999",5437,4938,4439,3940,3441,2942,2443,1445,null,null,"54,000-64,999",2.12,1.93,1.73,1.54,1.34,1.1499999999999999,0.95,0.56000000000000005]
[7.7,"9.5-9.9","Mini Split","9.5-9.9 HSPF",null,null,null,null,null,null,null,null,null,null,"9.5-9.9 HSPF"]
[7.7,"9.5-9.9","Mini Split","Size (Btuh) Post","< 15,000","15,000-20,999","21,000-26,999","27,000-32,999","33,000-38,999","39,000-44,999","45,000-53,999","54,000-64,999",null,null,"Size (Btuh) Post","< 15,000","15,000-20,999","21,000-26,999","27,000-32,999","33,000-38,999","39,000-44,999","45,000-53,999","54,000-64,999"]
[7.7,"9.5-9.9","Mini Split","Size (Btuh) Pre",null,null,null,null,null,null,null,null,null,null,"Size (Btuh) Pre"]
[7.7,"9.5-9.9","Mini Split","< 15,000",337,null,null,null,null,null,null,null,null,null,"< 15,000",0.13]
[7.7,"9.5-9.9","Mini Split","15,000-20,999",980,505,null,null,null,null,null,null,null,null,"15,000-20,999",0.38,0.2]
[7.7,"9.5-9.9","Mini Split","21,000-26,999",1624,1149,674,null,null,null,null,null,null,null,"21,000-26,999",0.63,0.45,0.26]
[7.7,"9.5-9.9","Mini Split","27,000-32,999",2267,1792,1317,842,null,null,null,null,null,null,"27,000-32,999",0.88,0.7,0.51,0.33]
[7.7,"9.5-9.9","Mini Split","33,000-38,999",2911,2436,1961,1486,1011,null,null,null,null,null,"33,000-38,999",1.1399999999999999,0.95,0.77,0.57999999999999996,0.39]
[7.7,"9.5-9.9","Mini Split","39,000-44,999",3554,3079,2604,2129,1654,1179,null,null,null,null,"39,000-44,999",1.39,1.2,1.02,0.83,0.65,0.46]
[7.7,"9.5-9.9","Mini Split","45,000-53,999",4198,3723,3248,2773,2298,1823,1348,null,null,null,"45,000-53,999",1.64,1.45,1.27,1.08,0.9,0.71,0.53]
[7.7,"9.5-9.9","Mini Split","54,000-64,999",5485,5010,4535,4060,3585,3110,2635,1685,null,null,"54,000-64,999",2.14,1.95,1.77,1.58,1.4,1.21,1.03,0.66]
[7.7,"10.0-10.4","Mini Split","10.0-10.4 HSPF",null,null,null,null,null,null,null,null,null,null,"10.0-10.4 HSPF"]
[7.7,"10.0-10.4","Mini Split","Size (Btuh) Post","< 15,000","15,000-20,999","21,000-26,999","27,000-32,999","33,000-38,999","39,000-44,999","45,000-53,999","54,000-64,999",null,null,"Size (Btuh) Post","< 15,000","15,000-20,999","21,000-26,999","27,000-32,999","33,000-38,999","39,000-44,999","45,000-53,999","54,000-64,999"]
[7.7,"10.0-10.4","Mini Split","Size (Btuh) Pre",null,null,null,null,null,null,null,null,null,null,"Size (Btuh) Pre"]
[7.7,"10.0-10.4","Mini Split","< 15,000",355,null,null,null,null,null,null,null,null,null,"< 15,000",0.14000000000000001]
[7.7,"10.0-10.4","Mini Split","15,000-20,999",999,533,null,null,null,null,null,null,null,null,"15,000-20,999",0.39,0.21]
[7.7,"10.0-10.4","Mini Split","21,000-26,999",1642,1176,710,null,null,null,null,null,null,null,"21,000-26,999",0.64,0.46,0.28000000000000003]
[7.7,"10.0-10.4","Mini Split","27,000-32,999",2285,1819,1354,888,null,null,null,null,null,null,"27,000-32,999",0.89,0.71,0.53,0.35]
[7.7,"10.0-10.4","Mini Split","33,000-38,999",2929,2463,1997,1531,1065,null,null,null,null,null,"33,000-38,999",1.1399999999999999,0.96,0.78,0.6,0.42]
[7.7,"10.0-10.4","Mini Split","39,000-44,999",3572,3106,2640,2175,1709,1243,null,null,null,null,"39,000-44,999",1.39,1.21,1.03,0.85,0.67,0.48]
[7.7,"10.0-10.4","Mini Split","45,000-53,999",4216,3750,3284,2818,2352,1886,1420,null,null,null,"45,000-53,999",1.64,1.46,1.28,1.1000000000000001,0.92,0.74,0.55000000000000004]
[7.7,"10.0-10.4","Mini Split","54,000-64,999",5503,5037,4571,4105,3639,3173,2707,1775,null,null,"54,000-64,999",2.15,1.97,1.78,1.6,1.42,1.24,1.06,0.69]
[7.7,"10.5-10.9","Mini Split","10.5-10.9 HSPF",null,null,null,null,null,null,null,null,null,null,"10.5-10.9 HSPF"]
[7.7,"10.5-10.9","Mini Split","Size (Btuh) Post","< 15,000","15,000-20,999","21,000-26,999","27,000-32,999","33,000-38,999","39,000-44,999","45,000-53,999","54,000-64,999",null,null,"Size (Btuh) Post","< 15,000","15,000-20,999","21,000-26,999","27,000-32,999","33,000-38,999","39,000-44,999","45,000-53,999","54,000-64,999"]
[7.7,"10.5-10.9","Mini Split","Size (Btuh) Pre",null,null,null,null,null,null,null,null,null,null,"Size (Btuh) Pre"]
[7.7,"10.5-10.9","Mini Split","< 15,000",372,null,null,null,null,null,null,null,null,null,"< 15,000",0.15]
[7.7,"10.5-10.9","Mini Split","15,000-20,999",1016,559,null,null,null,null,null,null,null,null,"15,000-20,999",0.4,0.22]
[7.7,"10.5-10.9","Mini Split","21,000-26,999",1659,1202,745,null,null,null,null,null,null,null,"21,000-26,999",0.65,0.47,0.28999999999999998]
[7.7,"10.5-10.9","Mini Split","27,000-32,999",2303,1846,1388,931,null,null,null,null,null,null,"27,000-32,999",0.9,0.72,0.54,0.36]
[7.7,"10.5-10.9","Mini Split","33,000-38,999",2946,2489,2032,1574,1117,null,null,null,null,null,"33,000-38,999",1.1499999999999999,0.97,0.79,0.61,0.44]
[7.7,"10.5-10.9","Mini Split","39,000-44,999",3590,3132,2675,2218,1761,1303,null,null,null,null,"39,000-44,999",1.4,1.22,1.04,0.87,0.69,0.51]
[7.7,"10.5-10.9","Mini Split","45,000-53,999",4233,3776,3319,2861,2404,1947,1490,null,null,null,"45,000-53,999",1.65,1.47,1.29,1.1200000000000001,0.94,0.76,0.57999999999999996]
[7.7,"10.5-10.9","Mini Split","54,000-64,999",5520,5063,4606,4148,3691,3234,2777,1862,null,null,"54,000-64,999",2.15,1.98,1.8,1.62,1.44,1.26,1.08,0.73]
[7.7,"11.0-11.4","Mini Split","11.0-11.4 HSPF",null,null,null,null,null,null,null,null,null,null,"11.0-11.4 HSPF"]
[7.7,"11.0-11.4","Mini Split","Size (Btuh) Post","< 15,000","15,000-20,999","21,000-26,999","27,000-32,999","33,000-38,999","39,000-44,999","45,000-53,999","54,000-64,999",null,null,"Size (Btuh) Post","< 15,000","15,000-20,999","21,000-26,999","27,000-32,999","33,000-38,999","39,000-44,999","45,000-53,999","54,000-64,999"]
[7.7,"11.0-11.4","Mini Split","Size (Btuh) Pre",null,null,null,null,null,null,null,null,null,null,"Size (Btuh) Pre"]
[7.7,"11.0-11.4","Mini Split","< 15,000",389,null,null,null,null,null,null,null,null,null,"< 15,000",0.15]
[7.7,"11.0-11.4","Mini Split","15,000-20,999",1033,584,null,null,null,null,null,null,null,null,"15,000-20,999",0.4,0.23]
[7.7,"11.0-11.4","Mini Split","21,000-26,999",1676,1227,778,null,null,null,null,null,null,null,"21,000-26,999",0.65,0.48,0.3]
[7.7,"11.0-11.4","Mini Split","27,000-32,999",2320,1871,1422,973,null,null,null,null,null,null,"27,000-32,999",0.9,0.73,0.55000000000000004,0.38]
[7.7,"11.0-11.4","Mini Split","33,000-38,999",2963,2514,2065,1616,1167,null,null,null,null,null,"33,000-38,999",1.1599999999999999,0.98,0.81,0.63,0.46]
[7.7,"11.0-11.4","Mini Split","39,000-44,999",3606,3158,2709,2260,1811,1362,null,null,null,null,"39,000-44,999",1.41,1.23,1.06,0.88,0.71,0.53]
[7.7,"11.0-11.4","Mini Split","45,000-53,999",4250,3801,3352,2903,2454,2005,1557,null,null,null,"45,000-53,999",1.66,1.48,1.31,1.1299999999999999,0.96,0.78,0.61]
[{"$f":"IFERROR(_xlfn.NUMBERVALUE(MID(D248,SEARCH(\"HSPF Base\",D248)-4,3)),A247)","v":7.7},{"$f":"IF(D249=\"Size (Btuh) Post\",LEFT(D248,SEARCH(\"HSPF\",D248)-2),B247)","v":"11.0-11.4"},"Mini Split","54,000-64,999",5537,5088,4639,4190,3741,3292,2844,1946,null,null,"54,000-64,999",2.16,1.99,1.81,1.63,1.46,1.28,1.1100000000000001,0.76]
[7.7,"11.5-11.9","Mini Split","11.5-11.9 HSPF",null,null,null,null,null,null,null,null,null,null,"11.5-11.9 HSPF"]
[7.7,"11.5-11.9","Mini Split","Size (Btuh) Post","< 15,000","15,000-20,999","21,000-26,999","27,000-32,999","33,000-38,999","39,000-44,999","45,000-53,999","54,000-64,999",null,null,"Size (Btuh) Post","< 15,000","15,000-20,999","21,000-26,999","27,000-32,999","33,000-38,999","39,000-44,999","45,000-53,999","54,000-64,999"]
[7.7,"11.5-11.9","Mini Split","Size (Btuh) Pre",null,null,null,null,null,null,null,null,null,null,"Size (Btuh) Pre"]
[7.7,"11.5-11.9","Mini Split","< 15,000",405,null,null,null,null,null,null,null,null,null,"< 15,000",0.16]
[7.7,"11.5-11.9","Mini Split","15,000-20,999",1049,608,null,null,null,null,null,null,null,null,"15,000-20,999",0.41,0.24]
[7.7,"11.5-11.9","Mini Split","21,000-26,999",1692,1251,811,null,null,null,null,null,null,null,"21,000-26,999",0.66,0.49,0.32]
[7.7,"11.5-11.9","Mini Split","27,000-32,999",2336,1895,1454,1013,null,null,null,null,null,null,"27,000-32,999",0.91,0.74,0.56999999999999995,0.4]
[7.7,"11.5-11.9","Mini Split","33,000-38,999",2979,2538,2097,1657,1216,null,null,null,null,null,"33,000-38,999",1.1599999999999999,0.99,0.82,0.65,0.47]
[7.7,"11.5-11.9","Mini Split","39,000-44,999",3623,3182,2741,2300,1859,1418,null,null,null,null,"39,000-44,999",1.41,1.24,1.07,0.9,0.73,0.55000000000000004]
[7.7,"11.5-11.9","Mini Split","45,000-53,999",4266,3825,3384,2944,2503,2062,1621,null,null,null,"45,000-53,999",1.66,1.49,1.32,1.1499999999999999,0.98,0.8,0.63]
[7.7,"11.5-11.9","Mini Split","54,000-64,999",5553,5112,4671,4231,3790,3349,2908,2026,null,null,"54,000-64,999",2.17,1.99,1.82,1.65,1.48,1.31,1.1299999999999999,0.79]
[7.7,"12.0+","Mini Split","12.0+ HSPF",null,null,null,null,null,null,null,null,null,null,"12.0+ HSPF"]
[7.7,"12.0+","Mini Split","Size (Btuh) Post","< 15,000","15,000-20,999","21,000-26,999","27,000-32,999","33,000-38,999","39,000-44,999","45,000-53,999","54,000-64,999",null,null,"Size (Btuh) Post","< 15,000","15,000-20,999","21,000-26,999","27,000-32,999","33,000-38,999","39,000-44,999","45,000-53,999","54,000-64,999"]
[7.7,"12.0+","Mini Split","Size (Btuh) Pre",null,null,null,null,null,null,null,null,null,null,"Size (Btuh) Pre"]
[7.7,"12.0+","Mini Split","< 15,000",415,null,null,null,null,null,null,null,null,null,"< 15,000",0.16]
[7.7,"12.0+","Mini Split","15,000-20,999",1058,622,null,null,null,null,null,null,null,null,"15,000-20,999",0.41,0.24]
[7.7,"12.0+","Mini Split","21,000-26,999",1702,1265,829,null,null,null,null,null,null,null,"21,000-26,999",0.66,0.49,0.32]
[7.7,"12.0+","Mini Split","27,000-32,999",2345,1909,1473,1037,null,null,null,null,null,null,"27,000-32,999",0.91,0.74,0.56999999999999995,0.4]
[7.7,"12.0+","Mini Split","33,000-38,999",2989,2552,2116,1680,1244,null,null,null,null,null,"33,000-38,999",1.17,1,0.83,0.66,0.49]
[7.7,"12.0+","Mini Split","39,000-44,999",3632,3196,2760,2324,1888,1451,null,null,null,null,"39,000-44,999",1.42,1.25,1.08,0.91,0.74,0.56999999999999995]
[7.7,"12.0+","Mini Split","45,000-53,999",4275,3839,3403,2967,2531,2095,1659,null,null,null,"45,000-53,999",1.67,1.5,1.33,1.1599999999999999,0.99,0.82,0.65]
[7.7,"12.0+","Mini Split","54,000-64,999",5562,5126,4690,4254,3818,3382,2946,2073,null,null,"54,000-64,999",2.17,2,1.83,1.66,1.49,1.32,1.1499999999999999,0.81]
[7.7,"12.0+","Mini Split"]
[6.8,"12.0+","Mini Split","Table B‑20: Mini-Split Energy Savings (Heating kWh) for 6.8 HSPF Baseline—Zone 5",null,null,null,null,null,null,null,null,null,null,"Table B‑40: Mini-Split Winter Demand Savings for 6.8 HSPF Baseline—Zone 5"]
[6.8,"8.5-8.9","Mini Split","8.5-8.9 HSPF",null,null,null,null,null,null,null,null,null,null,"8.5-8.9 HSPF"]
[6.8,"8.5-8.9","Mini Split","Size (Btuh) Post","< 15,000","15,000-20,999","21,000-26,999","27,000-32,999","33,000-38,999","39,000-44,999","45,000-53,999","54,000-64,999",null,null,"Size (Btuh) Post","< 15,000","15,000-20,999","21,000-26,999","27,000-32,999","33,000-38,999","39,000-44,999","45,000-53,999","54,000-64,999"]
[6.8,"8.5-8.9","Mini Split","Size (Btuh) Pre",null,null,null,null,null,null,null,null,null,null,"Size (Btuh) Pre"]
[6.8,"8.5-8.9","Mini Split","< 15,000",473,null,null,null,null,null,null,null,null,null,"< 15,000",0.18]
[6.8,"8.5-8.9","Mini Split","15,000-20,999",1255,710,null,null,null,null,null,null,null,null,"15,000-20,999",0.49,0.28000000000000003]
[6.8,"8.5-8.9","Mini Split","21,000-26,999",2037,1492,947,null,null,null,null,null,null,null,"21,000-26,999",0.79,0.57999999999999996,0.37]
[6.8,"8.5-8.9","Mini Split","27,000-32,999",2819,2274,1729,1184,null,null,null,null,null,null,"27,000-32,999",1.1000000000000001,0.89,0.67,0.46]
[6.8,"8.5-8.9","Mini Split","33,000-38,999",3601,3056,2511,1966,1420,null,null,null,null,null,"33,000-38,999",1.4,1.19,0.98,0.77,0.55000000000000004]
[6.8,"8.5-8.9","Mini Split","39,000-44,999",4383,3838,3293,2748,2202,1657,null,null,null,null,"39,000-44,999",1.71,1.5,1.28,1.07,0.86,0.65]
[6.8,"8.5-8.9","Mini Split","45,000-53,999",5165,4620,4075,3529,2984,2439,1894,null,null,null,"45,000-53,999",2.02,1.8,1.59,1.38,1.1599999999999999,0.95,0.74]
[6.8,"8.5-8.9","Mini Split","54,000-64,999",6729,6184,5638,5093,4548,4003,3458,2367,null,null,"54,000-64,999",2.63,2.41,2.2000000000000002,1.99,1.77,1.56,1.35,0.92]
[6.8,"9.0-9.4","Mini Split","9.0-9.4 HSPF",null,null,null,null,null,null,null,null,null,null,"9.0-9.4 HSPF"]
[6.8,"9.0-9.4","Mini Split","Size (Btuh) Post","< 15,000","15,000-20,999","21,000-26,999","27,000-32,999","33,000-38,999","39,000-44,999","45,000-53,999","54,000-64,999",null,null,"Size (Btuh) Post","< 15,000","15,000-20,999","21,000-26,999","27,000-32,999","33,000-38,999","39,000-44,999","45,000-53,999","54,000-64,999"]
[6.8,"9.0-9.4","Mini Split","Size (Btuh) Pre",null,null,null,null,null,null,null,null,null,null,"Size (Btuh) Pre"]
[6.8,"9.0-9.4","Mini Split","< 15,000",566,null,null,null,null,null,null,null,null,null,"< 15,000",0.22]
[6.8,"9.0-9.4","Mini Split","15,000-20,999",1348,849,null,null,null,null,null,null,null,null,"15,000-20,999",0.53,0.33]
[6.8,"9.0-9.4","Mini Split","21,000-26,999",2130,1631,1132,null,null,null,null,null,null,null,"21,000-26,999",0.83,0.64,0.44]
[6.8,"9.0-9.4","Mini Split","27,000-32,999",2912,2413,1914,1415,null,null,null,null,null,null,"27,000-32,999",1.1399999999999999,0.94,0.75,0.55000000000000004]
[6.8,"9.0-9.4","Mini Split","33,000-38,999",3693,3195,2696,2197,1698,null,null,null,null,null,"33,000-38,999",1.44,1.25,1.05,0.86,0.66]
[6.8,"9.0-9.4","Mini Split","39,000-44,999",4475,3976,3477,2979,2480,1981,null,null,null,null,"39,000-44,999",1.75,1.55,1.36,1.1599999999999999,0.97,0.77]
[6.8,"9.0-9.4","Mini Split","45,000-53,999",5257,4758,4259,3760,3261,2763,2264,null,null,null,"45,000-53,999",2.0499999999999998,1.86,1.66,1.47,1.27,1.08,0.88]
[6.8,"9.0-9.4","Mini Split","54,000-64,999",6821,6322,5823,5324,4825,4326,3827,2829,null,null,"54,000-64,999",2.66,2.4700000000000002,2.27,2.08,1.88,1.69,1.49,1.1000000000000001]
[6.8,"9.5-9.9","Mini Split","9.5-9.9 HSPF",null,null,null,null,null,null,null,null,null,null,"9.5-9.9 HSPF"]
[6.8,"9.5-9.9","Mini Split","Size (Btuh) Post","< 15,000","15,000-20,999","21,000-26,999","27,000-32,999","33,000-38,999","39,000-44,999","45,000-53,999","54,000-64,999",null,null,"Size (Btuh) Post","< 15,000","15,000-20,999","21,000-26,999","27,000-32,999","33,000-38,999","39,000-44,999","45,000-53,999","54,000-64,999"]
[6.8,"9.5-9.9","Mini Split","Size (Btuh) Pre",null,null,null,null,null,null,null,null,null,null,"Size (Btuh) Pre"]
[6.8,"9.5-9.9","Mini Split","< 15,000",614,null,null,null,null,null,null,null,null,null,"< 15,000",0.24]
[6.8,"9.5-9.9","Mini Split","15,000-20,999",1396,921,null,null,null,null,null,null,null,null,"15,000-20,999",0.54,0.36]
[6.8,"9.5-9.9","Mini Split","21,000-26,999",2178,1703,1228,null,null,null,null,null,null,null,"21,000-26,999",0.85,0.66,0.48]
[6.8,"9.5-9.9","Mini Split","27,000-32,999",2960,2485,2010,1535,null,null,null,null,null,null,"27,000-32,999",1.1499999999999999,0.97,0.78,0.6]
[6.8,"9.5-9.9","Mini Split","33,000-38,999",3741,3267,2792,2317,1842,null,null,null,null,null,"33,000-38,999",1.46,1.27,1.0900000000000001,0.9,0.72]
[6.8,"9.5-9.9","Mini Split","39,000-44,999",4523,4048,3573,3098,2624,2149,null,null,null,null,"39,000-44,999",1.76,1.58,1.39,1.21,1.02,0.84]
[6.8,"9.5-9.9","Mini Split","45,000-53,999",5305,4830,4355,3880,3405,2930,2455,null,null,null,"45,000-53,999",2.0699999999999998,1.88,1.7,1.51,1.33,1.1399999999999999,0.96]
[6.8,"9.5-9.9","Mini Split","54,000-64,999",6869,6394,5919,5444,4969,4494,4019,3069,null,null,"54,000-64,999",2.68,2.4900000000000002,2.31,2.12,1.94,1.75,1.57,1.2]
[6.8,"10.0-10.4","Mini Split","10.0-10.4 HSPF",null,null,null,null,null,null,null,null,null,null,"10.0-10.4 HSPF"]
[6.8,"10.0-10.4","Mini Split","Size (Btuh) Post","< 15,000","15,000-20,999","21,000-26,999","27,000-32,999","33,000-38,999","39,000-44,999","45,000-53,999","54,000-64,999",null,null,"Size (Btuh) Post","< 15,000","15,000-20,999","21,000-26,999","27,000-32,999","33,000-38,999","39,000-44,999","45,000-53,999","54,000-64,999"]
[6.8,"10.0-10.4","Mini Split","Size (Btuh) Pre",null,null,null,null,null,null,null,null,null,null,"Size (Btuh) Pre"]
[6.8,"10.0-10.4","Mini Split","< 15,000",632,null,null,null,null,null,null,null,null,null,"< 15,000",0.25]
[6.8,"10.0-10.4","Mini Split","15,000-20,999",1414,948,null,null,null,null,null,null,null,null,"15,000-20,999",0.55000000000000004,0.37]
[6.8,"10.0-10.4","Mini Split","21,000-26,999",2196,1730,1264,null,null,null,null,null,null,null,"21,000-26,999",0.86,0.67,0.49]
[{"$f":"IFERROR(_xlfn.NUMBERVALUE(MID(D312,SEARCH(\"HSPF Base\",D312)-4,3)),A311)","v":6.8},{"$f":"IF(D313=\"Size (Btuh) Post\",LEFT(D312,SEARCH(\"HSPF\",D312)-2),B311)","v":"10.0-10.4"},"Mini Split","27,000-32,999",2978,2512,2046,1580,null,null,null,null,null,null,"27,000-32,999",1.1599999999999999,0.98,0.8,0.62]
[6.8,"10.0-10.4","Mini Split","33,000-38,999",3760,3294,2828,2362,1896,null,null,null,null,null,"33,000-38,999",1.47,1.28,1.1000000000000001,0.92,0.74]
[6.8,"10.0-10.4","Mini Split","39,000-44,999",4541,4075,3610,3144,2678,2212,null,null,null,null,"39,000-44,999",1.77,1.59,1.41,1.23,1.04,0.86]
[6.8,"10.0-10.4","Mini Split","45,000-53,999",5323,4857,4391,3925,3460,2994,2528,null,null,null,"45,000-53,999",2.08,1.9,1.71,1.53,1.35,1.17,0.99]
[6.8,"10.0-10.4","Mini Split","54,000-64,999",6887,6421,5955,5489,5023,4557,4091,3160,null,null,"54,000-64,999",2.69,2.5099999999999998,2.3199999999999998,2.14,1.96,1.78,1.6,1.23]
[6.8,"10.5-10.9","Mini Split","10.5-10.9 HSPF",null,null,null,null,null,null,null,null,null,null,"10.5-10.9 HSPF"]
[6.8,"10.5-10.9","Mini Split","Size (Btuh) Post","< 15,000","15,000-20,999","21,000-26,999","27,000-32,999","33,000-38,999","39,000-44,999","45,000-53,999","54,000-64,999",null,null,"Size (Btuh) Post","< 15,000","15,000-20,999","21,000-26,999","27,000-32,999","33,000-38,999","39,000-44,999","45,000-53,999","54,000-64,999"]
[6.8,"10.5-10.9","Mini Split","Size (Btuh) Pre",null,null,null,null,null,null,null,null,null,null,"Size (Btuh) Pre"]
[6.8,"10.5-10.9","Mini Split","< 15,000",649,null,null,null,null,null,null,null,null,null,"< 15,000",0.25]
[6.8,"10.5-10.9","Mini Split","15,000-20,999",1431,974,null,null,null,null,null,null,null,null,"15,000-20,999",0.56000000000000005,0.38]
[6.8,"10.5-10.9","Mini Split","21,000-26,999",2213,1756,1299,null,null,null,null,null,null,null,"21,000-26,999",0.86,0.69,0.51]
[6.8,"10.5-10.9","Mini Split","27,000-32,999",2995,2538,2080,1623,null,null,null,null,null,null,"27,000-32,999",1.17,0.99,0.81,0.63]
[6.8,"10.5-10.9","Mini Split","33,000-38,999",3777,3320,2862,2405,1948,null,null,null,null,null,"33,000-38,999",1.47,1.3,1.1200000000000001,0.94,0.76]
[6.8,"10.5-10.9","Mini Split","39,000-44,999",4559,4102,3644,3187,2730,2272,null,null,null,null,"39,000-44,999",1.78,1.6,1.42,1.24,1.06,0.89]
[6.8,"10.5-10.9","Mini Split","45,000-53,999",5341,4883,4426,3969,3512,3054,2597,null,null,null,"45,000-53,999",2.08,1.91,1.73,1.55,1.37,1.19,1.01]
[6.8,"10.5-10.9","Mini Split","54,000-64,999",6905,6447,5990,5533,5075,4618,4161,3246,null,null,"54,000-64,999",2.69,2.52,2.34,2.16,1.98,1.8,1.62,1.27]
[6.8,"11.0-11.4","Mini Split","11.0-11.4 HSPF",null,null,null,null,null,null,null,null,null,null,"11.0-11.4 HSPF"]
[6.8,"11.0-11.4","Mini Split","Size (Btuh) Post","< 15,000","15,000-20,999","21,000-26,999","27,000-32,999","33,000-38,999","39,000-44,999","45,000-53,999","54,000-64,999",null,null,"Size (Btuh) Post","< 15,000","15,000-20,999","21,000-26,999","27,000-32,999","33,000-38,999","39,000-44,999","45,000-53,999","54,000-64,999"]
[6.8,"11.0-11.4","Mini Split","Size (Btuh) Pre",null,null,null,null,null,null,null,null,null,null,"Size (Btuh) Pre"]
[6.8,"11.0-11.4","Mini Split","< 15,000",666,null,null,null,null,null,null,null,null,null,"< 15,000",0.26]
[6.8,"11.0-11.4","Mini Split","15,000-20,999",1448,999,null,null,null,null,null,null,null,null,"15,000-20,999",0.56000000000000005,0.39]
[6.8,"11.0-11.4","Mini Split","21,000-26,999",2230,1781,1332,null,null,null,null,null,null,null,"21,000-26,999",0.87,0.69,0.52]
[6.8,"11.0-11.4","Mini Split","27,000-32,999",3012,2563,2114,1665,null,null,null,null,null,null,"27,000-32,999",1.18,1,0.82,0.65]
[6.8,"11.0-11.4","Mini Split","33,000-38,999",3794,3345,2896,2447,1998,null,null,null,null,null,"33,000-38,999",1.48,1.3,1.1299999999999999,0.95,0.78]
[6.8,"11.0-11.4","Mini Split","39,000-44,999",4576,4127,3678,3229,2780,2331,null,null,null,null,"39,000-44,999",1.79,1.61,1.43,1.26,1.08,0.91]
[6.8,"11.0-11.4","Mini Split","45,000-53,999",5357,4909,4460,4011,3562,3113,2664,null,null,null,"45,000-53,999",2.09,1.92,1.74,1.56,1.39,1.21,1.04]
[6.8,"11.0-11.4","Mini Split","54,000-64,999",6921,6472,6023,5575,5126,4677,4228,3330,null,null,"54,000-64,999",2.7,2.5299999999999998,2.35,2.17,2,1.82,1.65,1.3]
[6.8,"11.5-11.9","Mini Split","11.5-11.9 HSPF",null,null,null,null,null,null,null,null,null,null,"11.5-11.9 HSPF"]
[6.8,"11.5-11.9","Mini Split","Size (Btuh) Post","< 15,000","15,000-20,999","21,000-26,999","27,000-32,999","33,000-38,999","39,000-44,999","45,000-53,999","54,000-64,999",null,null,"Size (Btuh) Post","< 15,000","15,000-20,999","21,000-26,999","27,000-32,999","33,000-38,999","39,000-44,999","45,000-53,999","54,000-64,999"]
[6.8,"11.5-11.9","Mini Split","Size (Btuh) Pre",null,null,null,null,null,null,null,null,null,null,"Size (Btuh) Pre"]
[6.8,"11.5-11.9","Mini Split","< 15,000",682,null,null,null,null,null,null,null,null,null,"< 15,000",0.27]
[6.8,"11.5-11.9","Mini Split","15,000-20,999",1464,1023,null,null,null,null,null,null,null,null,"15,000-20,999",0.56999999999999995,0.4]
[6.8,"11.5-11.9","Mini Split","21,000-26,999",2246,1805,1364,null,null,null,null,null,null,null,"21,000-26,999",0.88,0.7,0.53]
[6.8,"11.5-11.9","Mini Split","27,000-32,999",3028,2587,2146,1705,null,null,null,null,null,null,"27,000-32,999",1.18,1.01,0.84,0.67]
[6.8,"11.5-11.9","Mini Split","33,000-38,999",3810,3369,2928,2487,2046,null,null,null,null,null,"33,000-38,999",1.49,1.31,1.1399999999999999,0.97,0.8]
[6.8,"11.5-11.9","Mini Split","39,000-44,999",4592,4151,3710,3269,2828,2388,null,null,null,null,"39,000-44,999",1.79,1.62,1.45,1.28,1.1000000000000001,0.93]
[6.8,"11.5-11.9","Mini Split","45,000-53,999",5374,4933,4492,4051,3610,3169,2729,null,null,null,"45,000-53,999",2.1,1.92,1.75,1.58,1.41,1.24,1.06]
[6.8,"11.5-11.9","Mini Split","54,000-64,999",6937,6497,6056,5615,5174,4733,4292,3411,null,null,"54,000-64,999",2.71,2.5299999999999998,2.36,2.19,2.02,1.85,1.67,1.33]
[6.8,"12.0+","Mini Split","12.0+ HSPF",null,null,null,null,null,null,null,null,null,null,"12.0+ HSPF"]
[6.8,"12.0+","Mini Split","Size (Btuh) Post","< 15,000","15,000-20,999","21,000-26,999","27,000-32,999","33,000-38,999","39,000-44,999","45,000-53,999","54,000-64,999",null,null,"Size (Btuh) Post","< 15,000","15,000-20,999","21,000-26,999","27,000-32,999","33,000-38,999","39,000-44,999","45,000-53,999","54,000-64,999"]
[6.8,"12.0+","Mini Split","Size (Btuh) Pre",null,null,null,null,null,null,null,null,null,null,"Size (Btuh) Pre"]
[6.8,"12.0+","Mini Split","< 15,000",692,null,null,null,null,null,null,null,null,null,"< 15,000",0.27]
[6.8,"12.0+","Mini Split","15,000-20,999",1473,1037,null,null,null,null,null,null,null,null,"15,000-20,999",0.56999999999999995,0.4]
[6.8,"12.0+","Mini Split","21,000-26,999",2255,1819,1383,null,null,null,null,null,null,null,"21,000-26,999",0.88,0.71,0.54]
[6.8,"12.0+","Mini Split","27,000-32,999",3037,2601,2165,1729,null,null,null,null,null,null,"27,000-32,999",1.18,1.01,0.84,0.67]
[6.8,"12.0+","Mini Split","33,000-38,999",3819,3383,2947,2511,2075,null,null,null,null,null,"33,000-38,999",1.49,1.32,1.1499999999999999,0.98,0.81]
[6.8,"12.0+","Mini Split","39,000-44,999",4601,4165,3729,3293,2857,2420,null,null,null,null,"39,000-44,999",1.8,1.62,1.45,1.28,1.1100000000000001,0.94]
[6.8,"12.0+","Mini Split","45,000-53,999",5383,4947,4511,4075,3638,3202,2766,null,null,null,"45,000-53,999",2.1,1.93,1.76,1.59,1.42,1.25,1.08]
[6.8,"12.0+","Mini Split","54,000-64,999",6947,6511,6075,5638,5202,4766,4330,3458,null,null,"54,000-64,999",2.71,2.54,2.37,2.2000000000000002,2.0299999999999998,1.86,1.69,1.35]

{"sheet":"Heating Resistance","index":10,"n_rows":180,"n_cols":22,"rows_kept":180,"cut":false,"hidden":true,"merged":[]}
["HSPF Range","Type"]
[null,null,"Table A‑30: Central Energy Savings (Heating kWh) for 3.41 HSPF Baseline—Zone 5",null,null,null,null,null,null,null,null,null,null,"Table A‑70: Central Winter Demand Savings for 3.41 HSPF Baseline—Zone 5"]
[{"$f":"IF(C4=\"Size (Btuh) Post\",LEFT(C3,SEARCH(\"HSPF\",C3)-2),A2)","v":"8.5-8.9"},"Central","8.5-8.9 HSPF",null,null,null,null,null,null,null,null,null,null,"8.5-8.9 HSPF"]
["8.5-8.9","Central","Size (Btuh) Post","< 15,000","15,000-20,999","21,000-26,999","27,000-32,999","33,000-38,999","39,000-44,999","45,000-53,999","54,000-64,999",null,null,"Size (Btuh) Post","< 15,000","15,000-20,999","21,000-26,999","27,000-32,999","33,000-38,999","39,000-44,999","45,000-53,999","54,000-64,999"]
["8.5-8.9","Central","Size (Btuh) Pre",null,null,null,null,null,null,null,null,null,null,"Size (Btuh) Pre"]
["8.5-8.9","Central","< 15,000",2563,null,null,null,null,null,null,null,null,null,"< 15,000",1]
["8.5-8.9","Central","15,000-20,999",4390,3844,null,null,null,null,null,null,null,null,"15,000-20,999",1.72,1.5]
["8.5-8.9","Central","21,000-26,999",6216,5671,5126,null,null,null,null,null,null,null,"21,000-26,999",2.4300000000000002,2.2200000000000002,2]
["8.5-8.9","Central","27,000-32,999",8043,7498,6953,6407,null,null,null,null,null,null,"27,000-32,999",3.14,2.93,2.72,2.5099999999999998]
["8.5-8.9","Central","33,000-38,999",9870,9324,8779,8234,7689,null,null,null,null,null,"33,000-38,999",3.86,3.65,3.43,3.22,3.01]
["8.5-8.9","Central","39,000-44,999",11696,11151,10606,10061,9516,8970,null,null,null,null,"39,000-44,999",4.57,4.3600000000000003,4.1500000000000004,3.93,3.72,3.51]
["8.5-8.9","Central","45,000-53,999",13523,12978,12432,11887,11342,10797,10252,null,null,null,"45,000-53,999",5.29,5.07,4.8600000000000003,4.6500000000000004,4.43,4.22,4.01]
["8.5-8.9","Central","54,000-64,999",17176,16631,16086,15541,14995,14450,13905,12815,null,null,"54,000-64,999",6.71,6.5,6.29,6.08,5.86,5.65,5.44,5.01]
["9.0-9.4","Central","9.0-9.4 HSPF",null,null,null,null,null,null,null,null,null,null,"9.0-9.4 HSPF"]
["9.0-9.4","Central","Size (Btuh) Post","< 15,000","15,000-20,999","21,000-26,999","27,000-32,999","33,000-38,999","39,000-44,999","45,000-53,999","54,000-64,999",null,null,"Size (Btuh) Post","< 15,000","15,000-20,999","21,000-26,999","27,000-32,999","33,000-38,999","39,000-44,999","45,000-53,999","54,000-64,999"]
["9.0-9.4","Central","Size (Btuh) Pre",null,null,null,null,null,null,null,null,null,null,"Size (Btuh) Pre"]
["9.0-9.4","Central","< 15,000",2655,null,null,null,null,null,null,null,null,null,"< 15,000",1.04]
["9.0-9.4","Central","15,000-20,999",4482,3983,null,null,null,null,null,null,null,null,"15,000-20,999",1.75,1.56]
["9.0-9.4","Central","21,000-26,999",6309,5810,5311,null,null,null,null,null,null,null,"21,000-26,999",2.4700000000000002,2.27,2.08]
["9.0-9.4","Central","27,000-32,999",8135,7636,7137,6638,null,null,null,null,null,null,"27,000-32,999",3.18,2.99,2.79,2.6]
["9.0-9.4","Central","33,000-38,999",9962,9463,8964,8465,7966,null,null,null,null,null,"33,000-38,999",3.89,3.7,3.5,3.31,3.12]
["9.0-9.4","Central","39,000-44,999",11789,11290,10791,10292,9793,9294,null,null,null,null,"39,000-44,999",4.6100000000000003,4.41,4.22,4.0199999999999996,3.83,3.63]
["9.0-9.4","Central","45,000-53,999",13615,13116,12617,12118,11619,11120,10621,null,null,null,"45,000-53,999",5.32,5.13,4.93,4.74,4.54,4.3499999999999996,4.1500000000000004]
["9.0-9.4","Central","54,000-64,999",17268,16770,16271,15772,15273,14774,14275,13277,null,null,"54,000-64,999",6.75,6.55,6.36,6.17,5.97,5.78,5.58,5.19]
["9.5-9.9","Central","9.5-9.9 HSPF",null,null,null,null,null,null,null,null,null,null,"9.5-9.9 HSPF"]
["9.5-9.9","Central","Size (Btuh) Post","< 15,000","15,000-20,999","21,000-26,999","27,000-32,999","33,000-38,999","39,000-44,999","45,000-53,999","54,000-64,999",null,null,"Size (Btuh) Post","< 15,000","15,000-20,999","21,000-26,999","27,000-32,999","33,000-38,999","39,000-44,999","45,000-53,999","54,000-64,999"]
["9.5-9.9","Central","Size (Btuh) Pre",null,null,null,null,null,null,null,null,null,null,"Size (Btuh) Pre"]
[{"$f":"IF(C29=\"Size (Btuh) Post\",LEFT(C28,SEARCH(\"HSPF\",C28)-2),A27)","v":"9.5-9.9"},"Central","< 15,000",2703,null,null,null,null,null,null,null,null,null,"< 15,000",1.06]
["9.5-9.9","Central","15,000-20,999",4530,4055,null,null,null,null,null,null,null,null,"15,000-20,999",1.77,1.59]
["9.5-9.9","Central","21,000-26,999",6357,5882,5407,null,null,null,null,null,null,null,"21,000-26,999",2.48,2.2999999999999998,2.11]
["9.5-9.9","Central","27,000-32,999",8183,7708,7233,6758,null,null,null,null,null,null,"27,000-32,999",3.2,3.01,2.83,2.64]
["9.5-9.9","Central","33,000-38,999",10010,9535,9060,8585,8110,null,null,null,null,null,"33,000-38,999",3.91,3.73,3.54,3.36,3.17]
["9.5-9.9","Central","39,000-44,999",11837,11362,10887,10412,9937,9462,null,null,null,null,"39,000-44,999",4.63,4.4400000000000004,4.26,4.07,3.89,3.7]
["9.5-9.9","Central","45,000-53,999",13663,13188,12713,12238,11763,11288,10813,null,null,null,"45,000-53,999",5.34,5.16,4.97,4.78,4.5999999999999996,4.41,4.2300000000000004]
["9.5-9.9","Central","54,000-64,999",17316,16841,16367,15892,15417,14942,14467,13517,null,null,"54,000-64,999",6.77,6.58,6.4,6.21,6.03,5.84,5.66,5.29]
["10.0-10.4","Central","10.0-10.4 HSPF",null,null,null,null,null,null,null,null,null,null,"10.0-10.4 HSPF"]
["10.0-10.4","Central","Size (Btuh) Post","< 15,000","15,000-20,999","21,000-26,999","27,000-32,999","33,000-38,999","39,000-44,999","45,000-53,999","54,000-64,999",null,null,"Size (Btuh) Post","< 15,000","15,000-20,999","21,000-26,999","27,000-32,999","33,000-38,999","39,000-44,999","45,000-53,999","54,000-64,999"]
["10.0-10.4","Central","Size (Btuh) Pre",null,null,null,null,null,null,null,null,null,null,"Size (Btuh) Pre"]
["10.0-10.4","Central","< 15,000",2721,null,null,null,null,null,null,null,null,null,"< 15,000",1.06]
["10.0-10.4","Central","15,000-20,999",4548,4082,null,null,null,null,null,null,null,null,"15,000-20,999",1.78,1.6]
["10.0-10.4","Central","21,000-26,999",6375,5909,5443,null,null,null,null,null,null,null,"21,000-26,999",2.4900000000000002,2.31,2.13]
["10.0-10.4","Central","27,000-32,999",8201,7735,7269,6803,null,null,null,null,null,null,"27,000-32,999",3.21,3.02,2.84,2.66]
["10.0-10.4","Central","33,000-38,999",10028,9562,9096,8630,8164,null,null,null,null,null,"33,000-38,999",3.92,3.74,3.56,3.37,3.19]
["10.0-10.4","Central","39,000-44,999",11855,11389,10923,10457,9991,9525,null,null,null,null,"39,000-44,999",4.63,4.45,4.2699999999999996,4.09,3.91,3.72]
["10.0-10.4","Central","45,000-53,999",13681,13215,12749,12283,11817,11351,10886,null,null,null,"45,000-53,999",5.35,5.17,4.9800000000000004,4.8,4.62,4.4400000000000004,4.26]
["10.0-10.4","Central","54,000-64,999",17334,16869,16403,15937,15471,15005,14539,13607,null,null,"54,000-64,999",6.78,6.59,6.41,6.23,6.05,5.87,5.68,5.32]
["10.5-10.9","Central","10.5-10.9 HSPF",null,null,null,null,null,null,null,null,null,null,"10.5-10.9 HSPF"]
["10.5-10.9","Central","Size (Btuh) Post","< 15,000","15,000-20,999","21,000-26,999","27,000-32,999","33,000-38,999","39,000-44,999","45,000-53,999","54,000-64,999",null,null,"Size (Btuh) Post","< 15,000","15,000-20,999","21,000-26,999","27,000-32,999","33,000-38,999","39,000-44,999","45,000-53,999","54,000-64,999"]
["10.5-10.9","Central","Size (Btuh) Pre",null,null,null,null,null,null,null,null,null,null,"Size (Btuh) Pre"]
["10.5-10.9","Central","< 15,000",2739,null,null,null,null,null,null,null,null,null,"< 15,000",1.07]
["10.5-10.9","Central","15,000-20,999",4565,4108,null,null,null,null,null,null,null,null,"15,000-20,999",1.78,1.61]
["10.5-10.9","Central","21,000-26,999",6392,5935,5478,null,null,null,null,null,null,null,"21,000-26,999",2.5,2.3199999999999998,2.14]
["10.5-10.9","Central","27,000-32,999",8219,7761,7304,6847,null,null,null,null,null,null,"27,000-32,999",3.21,3.03,2.86,2.68]
["10.5-10.9","Central","33,000-38,999",10045,9588,9131,8674,8216,null,null,null,null,null,"33,000-38,999",3.93,3.75,3.57,3.39,3.21]
["10.5-10.9","Central","39,000-44,999",11872,11415,10957,10500,10043,9586,null,null,null,null,"39,000-44,999",4.6399999999999997,4.46,4.28,4.1100000000000003,3.93,3.75]
["10.5-10.9","Central","45,000-53,999",13699,13241,12784,12327,11870,11412,10955,null,null,null,"45,000-53,999",5.35,5.18,5,4.82,4.6399999999999997,4.46,4.28]
["10.5-10.9","Central","54,000-64,999",17352,16895,16437,15980,15523,15066,14608,13694,null,null,"54,000-64,999",6.78,6.6,6.43,6.25,6.07,5.89,5.71,5.35]
["11.0-11.4","Central","11.0-11.4 HSPF",null,null,null,null,null,null,null,null,null,null,"11.0-11.4 HSPF"]
["11.0-11.4","Central","Size (Btuh) Post","< 15,000","15,000-20,999","21,000-26,999","27,000-32,999","33,000-38,999","39,000-44,999","45,000-53,999","54,000-64,999",null,null,"Size (Btuh) Post","< 15,000","15,000-20,999","21,000-26,999","27,000-32,999","33,000-38,999","39,000-44,999","45,000-53,999","54,000-64,999"]
["11.0-11.4","Central","Size (Btuh) Pre",null,null,null,null,null,null,null,null,null,null,"Size (Btuh) Pre"]
["11.0-11.4","Central","< 15,000",2755,null,null,null,null,null,null,null,null,null,"< 15,000",1.08]
["11.0-11.4","Central","15,000-20,999",4582,4133,null,null,null,null,null,null,null,null,"15,000-20,999",1.79,1.62]
["11.0-11.4","Central","21,000-26,999",6409,5960,5511,null,null,null,null,null,null,null,"21,000-26,999",2.5099999999999998,2.33,2.15]
["11.0-11.4","Central","27,000-32,999",8235,7787,7338,6889,null,null,null,null,null,null,"27,000-32,999",3.22,3.04,2.87,2.69]
["11.0-11.4","Central","33,000-38,999",10062,9613,9164,8715,8266,null,null,null,null,null,"33,000-38,999",3.93,3.76,3.58,3.41,3.23]
["11.0-11.4","Central","39,000-44,999",11889,11440,10991,10542,10093,9644,null,null,null,null,"39,000-44,999",4.6500000000000004,4.47,4.3,4.12,3.95,3.77]
["11.0-11.4","Central","45,000-53,999",13715,13266,12818,12369,11920,11471,11022,null,null,null,"45,000-53,999",5.36,5.19,5.01,4.84,4.66,4.4800000000000004,4.3099999999999996]
["11.0-11.4","Central","54,000-64,999",17369,16920,16471,16022,15573,15124,14675,13777,null,null,"54,000-64,999",6.79,6.61,6.44,6.26,6.09,5.91,5.74,5.39]
["11.5-11.9","Central","11.5-11.9 HSPF",null,null,null,null,null,null,null,null,null,null,"11.5-11.9 HSPF"]
["11.5-11.9","Central","Size (Btuh) Post","< 15,000","15,000-20,999","21,000-26,999","27,000-32,999","33,000-38,999","39,000-44,999","45,000-53,999","54,000-64,999",null,null,"Size (Btuh) Post","< 15,000","15,000-20,999","21,000-26,999","27,000-32,999","33,000-38,999","39,000-44,999","45,000-53,999","54,000-64,999"]
["11.5-11.9","Central","Size (Btuh) Pre",null,null,null,null,null,null,null,null,null,null,"Size (Btuh) Pre"]
["11.5-11.9","Central","< 15,000",2772,null,null,null,null,null,null,null,null,null,"< 15,000",1.08]
["11.5-11.9","Central","15,000-20,999",4598,4157,null,null,null,null,null,null,null,null,"15,000-20,999",1.8,1.63]
["11.5-11.9","Central","21,000-26,999",6425,5984,5543,null,null,null,null,null,null,null,"21,000-26,999",2.5099999999999998,2.34,2.17]
["11.5-11.9","Central","27,000-32,999",8252,7811,7370,6929,null,null,null,null,null,null,"27,000-32,999",3.23,3.05,2.88,2.71]
["11.5-11.9","Central","33,000-38,999",10078,9637,9197,8756,8315,null,null,null,null,null,"33,000-38,999",3.94,3.77,3.6,3.42,3.25]
["11.5-11.9","Central","39,000-44,999",11905,11464,11023,10582,10141,9701,null,null,null,null,"39,000-44,999",4.6500000000000004,4.4800000000000004,4.3099999999999996,4.1399999999999997,3.97,3.79]
["11.5-11.9","Central","45,000-53,999",13731,13291,12850,12409,11968,11527,11086,null,null,null,"45,000-53,999",5.37,5.19,5.0199999999999996,4.8499999999999996,4.68,4.51,4.34]
["11.5-11.9","Central","54,000-64,999",17385,16944,16503,16062,15621,15181,14740,13858,null,null,"54,000-64,999",6.79,6.62,6.45,6.28,6.11,5.93,5.76,5.42]
["12.0+","Central","12.0+ HSPF",null,null,null,null,null,null,null,null,null,null,"12.0+ HSPF"]
["12.0+","Central","Size (Btuh) Post","< 15,000","15,000-20,999","21,000-26,999","27,000-32,999","33,000-38,999","39,000-44,999","45,000-53,999","54,000-64,999",null,null,"Size (Btuh) Post","< 15,000","15,000-20,999","21,000-26,999","27,000-32,999","33,000-38,999","39,000-44,999","45,000-53,999","54,000-64,999"]
["12.0+","Central","Size (Btuh) Pre",null,null,null,null,null,null,null,null,null,null,"Size (Btuh) Pre"]
["12.0+","Central","< 15,000",2781,null,null,null,null,null,null,null,null,null,"< 15,000",1.0900000000000001]
["12.0+","Central","15,000-20,999",4608,4172,null,null,null,null,null,null,null,null,"15,000-20,999",1.8,1.63]
["12.0+","Central","21,000-26,999",6434,5998,5562,null,null,null,null,null,null,null,"21,000-26,999",2.52,2.35,2.17]
["12.0+","Central","27,000-32,999",8261,7825,7389,6953,null,null,null,null,null,null,"27,000-32,999",3.23,3.06,2.89,2.72]
["12.0+","Central","33,000-38,999",10088,9651,9215,8779,8343,null,null,null,null,null,"33,000-38,999",3.94,3.77,3.6,3.43,3.26]
["12.0+","Central","39,000-44,999",11914,11478,11042,10606,10170,9734,null,null,null,null,"39,000-44,999",4.66,4.49,4.32,4.1500000000000004,3.98,3.81]
["12.0+","Central","45,000-53,999",13741,13305,12869,12432,11996,11560,11124,null,null,null,"45,000-53,999",5.37,5.2,5.03,4.8600000000000003,4.6900000000000004,4.5199999999999996,4.3499999999999996]
["12.0+","Central","54,000-64,999",17394,16958,16522,16086,15650,15213,14777,13905,null,null,"54,000-64,999",6.8,6.63,6.46,6.29,6.12,5.95,5.78,5.44]
[{"$f":"IF(C92=\"Size (Btuh) Post\",LEFT(C91,SEARCH(\"HSPF\",C91)-2),A90)","v":"12.0+"},"Central"]
["12.0+","Mini Split","Table B‑10: Mini-Split Energy Savings (Heating kWh) for 3.41 HSPF Baseline—Zone 5",null,null,null,null,null,null,null,null,null,null,"Table B‑30: Mini-Split Winter Demand Savings for 3.41 HSPF Baseline—Zone 5"]
[{"$f":"IF(C94=\"Size (Btuh) Post\",LEFT(C93,SEARCH(\"HSPF\",C93)-2),A92)","v":"8.5-8.9"},"Mini Split","8.5-8.9 HSPF",null,null,null,null,null,null,null,null,null,null,"8.5-8.9 HSPF"]
["8.5-8.9","Mini Split","Size (Btuh) Post","< 15,000","15,000-20,999","21,000-26,999","27,000-32,999","33,000-38,999","39,000-44,999","45,000-53,999","54,000-64,999",null,null,"Size (Btuh) Post","< 15,000","15,000-20,999","21,000-26,999","27,000-32,999","33,000-38,999","39,000-44,999","45,000-53,999","54,000-64,999"]
["8.5-8.9","Mini Split","Size (Btuh) Pre",null,null,null,null,null,null,null,null,null,null,"Size (Btuh) Pre"]
["8.5-8.9","Mini Split","< 15,000",2563,null,null,null,null,null,null,null,null,null,"< 15,000",1]
["8.5-8.9","Mini Split","15,000-20,999",4390,3844,null,null,null,null,null,null,null,null,"15,000-20,999",1.72,1.5]
["8.5-8.9","Mini Split","21,000-26,999",6216,5671,5126,null,null,null,null,null,null,null,"21,000-26,999",2.4300000000000002,2.2200000000000002,2]
["8.5-8.9","Mini Split","27,000-32,999",8043,7498,6953,6407,null,null,null,null,null,null,"27,000-32,999",3.14,2.93,2.72,2.5099999999999998]
["8.5-8.9","Mini Split","33,000-38,999",9870,9324,8779,8234,7689,null,null,null,null,null,"33,000-38,999",3.86,3.65,3.43,3.22,3.01]
["8.5-8.9","Mini Split","39,000-44,999",11696,11151,10606,10061,9516,8970,null,null,null,null,"39,000-44,999",4.57,4.3600000000000003,4.1500000000000004,3.93,3.72,3.51]
["8.5-8.9","Mini Split","45,000-53,999",13523,12978,12432,11887,11342,10797,10252,null,null,null,"45,000-53,999",5.29,5.07,4.8600000000000003,4.6500000000000004,4.43,4.22,4.01]
["8.5-8.9","Mini Split","54,000-64,999",17176,16631,16086,15541,14995,14450,13905,12815,null,null,"54,000-64,999",6.71,6.5,6.29,6.08,5.86,5.65,5.44,5.01]
["9.0-9.4","Mini Split","9.0-9.4 HSPF",null,null,null,null,null,null,null,null,null,null,"9.0-9.4 HSPF"]
["9.0-9.4","Mini Split","Size (Btuh) Post","< 15,000","15,000-20,999","21,000-26,999","27,000-32,999","33,000-38,999","39,000-44,999","45,000-53,999","54,000-64,999",null,null,"Size (Btuh) Post","< 15,000","15,000-20,999","21,000-26,999","27,000-32,999","33,000-38,999","39,000-44,999","45,000-53,999","54,000-64,999"]
["9.0-9.4","Mini Split","Size (Btuh) Pre",null,null,null,null,null,null,null,null,null,null,"Size (Btuh) Pre"]
["9.0-9.4","Mini Split","< 15,000",2655,null,null,null,null,null,null,null,null,null,"< 15,000",1.04]
["9.0-9.4","Mini Split","15,000-20,999",4482,3983,null,null,null,null,null,null,null,null,"15,000-20,999",1.75,1.56]
["9.0-9.4","Mini Split","21,000-26,999",6309,5810,5311,null,null,null,null,null,null,null,"21,000-26,999",2.4700000000000002,2.27,2.08]
["9.0-9.4","Mini Split","27,000-32,999",8135,7636,7137,6638,null,null,null,null,null,null,"27,000-32,999",3.18,2.99,2.79,2.6]
["9.0-9.4","Mini Split","33,000-38,999",9962,9463,8964,8465,7966,null,null,null,null,null,"33,000-38,999",3.89,3.7,3.5,3.31,3.12]
["9.0-9.4","Mini Split","39,000-44,999",11789,11290,10791,10292,9793,9294,null,null,null,null,"39,000-44,999",4.6100000000000003,4.41,4.22,4.0199999999999996,3.83,3.63]
["9.0-9.4","Mini Split","45,000-53,999",13615,13116,12617,12118,11619,11120,10621,null,null,null,"45,000-53,999",5.32,5.13,4.93,4.74,4.54,4.3499999999999996,4.1500000000000004]
["9.0-9.4","Mini Split","54,000-64,999",17268,16770,16271,15772,15273,14774,14275,13277,null,null,"54,000-64,999",6.75,6.55,6.36,6.17,5.97,5.78,5.58,5.19]
["9.5-9.9","Mini Split","9.5-9.9 HSPF",null,null,null,null,null,null,null,null,null,null,"9.5-9.9 HSPF"]
["9.5-9.9","Mini Split","Size (Btuh) Post","< 15,000","15,000-20,999","21,000-26,999","27,000-32,999","33,000-38,999","39,000-44,999","45,000-53,999","54,000-64,999",null,null,"Size (Btuh) Post","< 15,000","15,000-20,999","21,000-26,999","27,000-32,999","33,000-38,999","39,000-44,999","45,000-53,999","54,000-64,999"]
["9.5-9.9","Mini Split","Size (Btuh) Pre",null,null,null,null,null,null,null,null,null,null,"Size (Btuh) Pre"]
["9.5-9.9","Mini Split","< 15,000",2703,null,null,null,null,null,null,null,null,null,"< 15,000",1.06]
["9.5-9.9","Mini Split","15,000-20,999",4530,4055,null,null,null,null,null,null,null,null,"15,000-20,999",1.77,1.59]
["9.5-9.9","Mini Split","21,000-26,999",6357,5882,5407,null,null,null,null,null,null,null,"21,000-26,999",2.48,2.2999999999999998,2.11]
["9.5-9.9","Mini Split","27,000-32,999",8183,7708,7233,6758,null,null,null,null,null,null,"27,000-32,999",3.2,3.01,2.83,2.64]
["9.5-9.9","Mini Split","33,000-38,999",10010,9535,9060,8585,8110,null,null,null,null,null,"33,000-38,999",3.91,3.73,3.54,3.36,3.17]
["9.5-9.9","Mini Split","39,000-44,999",11837,11362,10887,10412,9937,9462,null,null,null,null,"39,000-44,999",4.63,4.4400000000000004,4.26,4.07,3.89,3.7]
["9.5-9.9","Mini Split","45,000-53,999",13663,13188,12713,12238,11763,11288,10813,null,null,null,"45,000-53,999",5.34,5.16,4.97,4.78,4.5999999999999996,4.41,4.2300000000000004]
["9.5-9.9","Mini Split","54,000-64,999",17316,16841,16367,15892,15417,14942,14467,13517,null,null,"54,000-64,999",6.77,6.58,6.4,6.21,6.03,5.84,5.66,5.29]
["10.0-10.4","Mini Split","10.0-10.4 HSPF",null,null,null,null,null,null,null,null,null,null,"10.0-10.4 HSPF"]
["10.0-10.4","Mini Split","Size (Btuh) Post","< 15,000","15,000-20,999","21,000-26,999","27,000-32,999","33,000-38,999","39,000-44,999","45,000-53,999","54,000-64,999",null,null,"Size (Btuh) Post","< 15,000","15,000-20,999","21,000-26,999","27,000-32,999","33,000-38,999","39,000-44,999","45,000-53,999","54,000-64,999"]
["10.0-10.4","Mini Split","Size (Btuh) Pre",null,null,null,null,null,null,null,null,null,null,"Size (Btuh) Pre"]
["10.0-10.4","Mini Split","< 15,000",2721,null,null,null,null,null,null,null,null,null,"< 15,000",1.06]
["10.0-10.4","Mini Split","15,000-20,999",4548,4082,null,null,null,null,null,null,null,null,"15,000-20,999",1.78,1.6]
["10.0-10.4","Mini Split","21,000-26,999",6375,5909,5443,null,null,null,null,null,null,null,"21,000-26,999",2.4900000000000002,2.31,2.13]
["10.0-10.4","Mini Split","27,000-32,999",8201,7735,7269,6803,null,null,null,null,null,null,"27,000-32,999",3.21,3.02,2.84,2.66]
["10.0-10.4","Mini Split","33,000-38,999",10028,9562,9096,8630,8164,null,null,null,null,null,"33,000-38,999",3.92,3.74,3.56,3.37,3.19]
["10.0-10.4","Mini Split","39,000-44,999",11855,11389,10923,10457,9991,9525,null,null,null,null,"39,000-44,999",4.63,4.45,4.2699999999999996,4.09,3.91,3.72]
["10.0-10.4","Mini Split","45,000-53,999",13681,13215,12749,12283,11817,11351,10886,null,null,null,"45,000-53,999",5.35,5.17,4.9800000000000004,4.8,4.62,4.4400000000000004,4.26]
["10.0-10.4","Mini Split","54,000-64,999",17334,16869,16403,15937,15471,15005,14539,13607,null,null,"54,000-64,999",6.78,6.59,6.41,6.23,6.05,5.87,5.68,5.32]
["10.5-10.9","Mini Split","10.5-10.9 HSPF",null,null,null,null,null,null,null,null,null,null,"10.5-10.9 HSPF"]
["10.5-10.9","Mini Split","Size (Btuh) Post","< 15,000","15,000-20,999","21,000-26,999","27,000-32,999","33,000-38,999","39,000-44,999","45,000-53,999","54,000-64,999",null,null,"Size (Btuh) Post","< 15,000","15,000-20,999","21,000-26,999","27,000-32,999","33,000-38,999","39,000-44,999","45,000-53,999","54,000-64,999"]
["10.5-10.9","Mini Split","Size (Btuh) Pre",null,null,null,null,null,null,null,null,null,null,"Size (Btuh) Pre"]
["10.5-10.9","Mini Split","< 15,000",2739,null,null,null,null,null,null,null,null,null,"< 15,000",1.07]
["10.5-10.9","Mini Split","15,000-20,999",4565,4108,null,null,null,null,null,null,null,null,"15,000-20,999",1.78,1.61]
["10.5-10.9","Mini Split","21,000-26,999",6392,5935,5478,null,null,null,null,null,null,null,"21,000-26,999",2.5,2.3199999999999998,2.14]
["10.5-10.9","Mini Split","27,000-32,999",8219,7761,7304,6847,null,null,null,null,null,null,"27,000-32,999",3.21,3.03,2.86,2.68]
["10.5-10.9","Mini Split","33,000-38,999",10045,9588,9131,8674,8216,null,null,null,null,null,"33,000-38,999",3.93,3.75,3.57,3.39,3.21]
["10.5-10.9","Mini Split","39,000-44,999",11872,11415,10957,10500,10043,9586,null,null,null,null,"39,000-44,999",4.6399999999999997,4.46,4.28,4.1100000000000003,3.93,3.75]
["10.5-10.9","Mini Split","45,000-53,999",13699,13241,12784,12327,11870,11412,10955,null,null,null,"45,000-53,999",5.35,5.18,5,4.82,4.6399999999999997,4.46,4.28]
["10.5-10.9","Mini Split","54,000-64,999",17352,16895,16437,15980,15523,15066,14608,13694,null,null,"54,000-64,999",6.78,6.6,6.43,6.25,6.07,5.89,5.71,5.35]
["11.0-11.4","Mini Split","11.0-11.4 HSPF",null,null,null,null,null,null,null,null,null,null,"11.0-11.4 HSPF"]
["11.0-11.4","Mini Split","Size (Btuh) Post","< 15,000","15,000-20,999","21,000-26,999","27,000-32,999","33,000-38,999","39,000-44,999","45,000-53,999","54,000-64,999",null,null,"Size (Btuh) Post","< 15,000","15,000-20,999","21,000-26,999","27,000-32,999","33,000-38,999","39,000-44,999","45,000-53,999","54,000-64,999"]
["11.0-11.4","Mini Split","Size (Btuh) Pre",null,null,null,null,null,null,null,null,null,null,"Size (Btuh) Pre"]
["11.0-11.4","Mini Split","< 15,000",2755,null,null,null,null,null,null,null,null,null,"< 15,000",1.08]
["11.0-11.4","Mini Split","15,000-20,999",4582,4133,null,null,null,null,null,null,null,null,"15,000-20,999",1.79,1.62]
["11.0-11.4","Mini Split","21,000-26,999",6409,5960,5511,null,null,null,null,null,null,null,"21,000-26,999",2.5099999999999998,2.33,2.15]
["11.0-11.4","Mini Split","27,000-32,999",8235,7787,7338,6889,null,null,null,null,null,null,"27,000-32,999",3.22,3.04,2.87,2.69]
["11.0-11.4","Mini Split","33,000-38,999",10062,9613,9164,8715,8266,null,null,null,null,null,"33,000-38,999",3.93,3.76,3.58,3.41,3.23]
["11.0-11.4","Mini Split","39,000-44,999",11889,11440,10991,10542,10093,9644,null,null,null,null,"39,000-44,999",4.6500000000000004,4.47,4.3,4.12,3.95,3.77]
[{"$f":"IF(C158=\"Size (Btuh) Post\",LEFT(C157,SEARCH(\"HSPF\",C157)-2),A156)","v":"11.0-11.4"},"Mini Split","45,000-53,999",13715,13266,12818,12369,11920,11471,11022,null,null,null,"45,000-53,999",5.36,5.19,5.01,4.84,4.66,4.4800000000000004,4.3099999999999996]
["11.0-11.4","Mini Split","54,000-64,999",17369,16920,16471,16022,15573,15124,14675,13777,null,null,"54,000-64,999",6.79,6.61,6.44,6.26,6.09,5.91,5.74,5.39]
["11.5-11.9","Mini Split","11.5-11.9 HSPF",null,null,null,null,null,null,null,null,null,null,"11.5-11.9 HSPF"]
["11.5-11.9","Mini Split","Size (Btuh) Post","< 15,000","15,000-20,999","21,000-26,999","27,000-32,999","33,000-38,999","39,000-44,999","45,000-53,999","54,000-64,999",null,null,"Size (Btuh) Post","< 15,000","15,000-20,999","21,000-26,999","27,000-32,999","33,000-38,999","39,000-44,999","45,000-53,999","54,000-64,999"]
["11.5-11.9","Mini Split","Size (Btuh) Pre",null,null,null,null,null,null,null,null,null,null,"Size (Btuh) Pre"]
["11.5-11.9","Mini Split","< 15,000",2772,null,null,null,null,null,null,null,null,null,"< 15,000",1.08]
["11.5-11.9","Mini Split","15,000-20,999",4598,4157,null,null,null,null,null,null,null,null,"15,000-20,999",1.8,1.63]
["11.5-11.9","Mini Split","21,000-26,999",6425,5984,5543,null,null,null,null,null,null,null,"21,000-26,999",2.5099999999999998,2.34,2.17]
["11.5-11.9","Mini Split","27,000-32,999",8252,7811,7370,6929,null,null,null,null,null,null,"27,000-32,999",3.23,3.05,2.88,2.71]
["11.5-11.9","Mini Split","33,000-38,999",10078,9637,9197,8756,8315,null,null,null,null,null,"33,000-38,999",3.94,3.77,3.6,3.42,3.25]
["11.5-11.9","Mini Split","39,000-44,999",11905,11464,11023,10582,10141,9701,null,null,null,null,"39,000-44,999",4.6500000000000004,4.4800000000000004,4.3099999999999996,4.1399999999999997,3.97,3.79]
["11.5-11.9","Mini Split","45,000-53,999",13731,13291,12850,12409,11968,11527,11086,null,null,null,"45,000-53,999",5.37,5.19,5.0199999999999996,4.8499999999999996,4.68,4.51,4.34]
["11.5-11.9","Mini Split","54,000-64,999",17385,16944,16503,16062,15621,15181,14740,13858,null,null,"54,000-64,999",6.79,6.62,6.45,6.28,6.11,5.93,5.76,5.42]
["12.0+","Mini Split","12.0+ HSPF",null,null,null,null,null,null,null,null,null,null,"12.0+ HSPF"]
["12.0+","Mini Split","Size (Btuh) Post","< 15,000","15,000-20,999","21,000-26,999","27,000-32,999","33,000-38,999","39,000-44,999","45,000-53,999","54,000-64,999",null,null,"Size (Btuh) Post","< 15,000","15,000-20,999","21,000-26,999","27,000-32,999","33,000-38,999","39,000-44,999","45,000-53,999","54,000-64,999"]
["12.0+","Mini Split","Size (Btuh) Pre",null,null,null,null,null,null,null,null,null,null,"Size (Btuh) Pre"]
["12.0+","Mini Split","< 15,000",2781,null,null,null,null,null,null,null,null,null,"< 15,000",1.0900000000000001]
["12.0+","Mini Split","15,000-20,999",4608,4172,null,null,null,null,null,null,null,null,"15,000-20,999",1.8,1.63]
["12.0+","Mini Split","21,000-26,999",6434,5998,5562,null,null,null,null,null,null,null,"21,000-26,999",2.52,2.35,2.17]
["12.0+","Mini Split","27,000-32,999",8261,7825,7389,6953,null,null,null,null,null,null,"27,000-32,999",3.23,3.06,2.89,2.72]
["12.0+","Mini Split","33,000-38,999",10088,9651,9215,8779,8343,null,null,null,null,null,"33,000-38,999",3.94,3.77,3.6,3.43,3.26]
["12.0+","Mini Split","39,000-44,999",11914,11478,11042,10606,10170,9734,null,null,null,null,"39,000-44,999",4.66,4.49,4.32,4.1500000000000004,3.98,3.81]
["12.0+","Mini Split","45,000-53,999",13741,13305,12869,12432,11996,11560,11124,null,null,null,"45,000-53,999",5.37,5.2,5.03,4.8600000000000003,4.6900000000000004,4.5199999999999996,4.3499999999999996]
["12.0+","Mini Split","54,000-64,999",17394,16958,16522,16086,15650,15213,14777,13905,null,null,"54,000-64,999",6.8,6.63,6.46,6.29,6.12,5.95,5.78,5.44]

{"sheet":"Wall Insulation","index":11,"n_rows":14,"n_cols":4,"rows_kept":14,"cut":false,"hidden":true,"merged":[[1,1,1,3],[2,1,2,3]]}
[]
[null,"Wall Insulation"]
[null,"Instructions: Enter the project information in the yellow cells below."]
[]
[null,"Cooling Type"]
[null,"Heating Type"]
[null,"Wall Size"]
[null,"Wall Area",null,"sq ft"]
[null,"Base Case Wall Insulation"]
[null,"Proposed Wall Insulation"]
[]
[null,"Energy Savings",{"$f":"'Wall Insulation Lookup'!C29","v":0},"kWh"]
[null,{"$f":"IF('Wall Insulation Lookup'!C31=C13,\"Summer\",\"Winter\")&\" Peak Demand Savings\"","v":"Summer Peak Demand Savings"},{"$f":"MAX('Wall Insulation Lookup'!C31:C32)","v":0},"kW"]
[null,"Incentive",{"$f":"Incentive_Rate*C13","v":0}]

{"sheet":"Wall Insulation Lookup","index":12,"n_rows":98,"n_cols":19,"rows_kept":98,"cut":false,"hidden":true,"merged":[[9,2,15,5],[1,2,7,5]]}
[]
[null,"Baseline Condition:","The baseline is considered to be a house with little or no wall insulation in the wall cavity. For those homes for which a minimal level of insulation is encountered, the baseline is established at R-4. This baseline should be used to represent homes for which installed insulation covers a very limited amount of the wall area to be treated, is significantly degraded, and/or is less than an inch thick. Homes with more than this base level of insulation are not eligible for the measure. Baseline homes may have either 2x4 or 2x6 construction.",null,null,null,null,null,null,"Climate Zone","Base Case Wall Insulation","Cooling Type","Heating Type","Type of Wall","New Material","Cooling Savings","Heating Savings","Summer Demand Savings","Winter Demand Savings"]
[null,null,null,null,null,null,null,null,null,"Climate Zone 5: West","Uninsulated","Refrigerated Air","Gas","2x4","Fiberglass batt or cellulose",0.76,0.09,6.5200000000000002E-4,2.0599999999999999E-5]
[null,null,null,null,null,null,null,null,null,"Climate Zone 5: West","Uninsulated","Refrigerated Air","Electric Resistance","2x4","Fiberglass batt or cellulose",0.76,2.4,6.5200000000000002E-4,6.78E-4]
[null,null,null,null,null,null,null,null,null,"Climate Zone 5: West","Uninsulated","Refrigerated Air","Heat Pump","2x4","Fiberglass batt or cellulose",0.76,0.98,6.5200000000000002E-4,2.8400000000000002E-4]
[null,null,null,null,null,null,null,null,null,"Climate Zone 5: West","Uninsulated","Refrigerated Air","Gas","2x4","Fiberglass batt or cellulose",0.76,0.09,6.5200000000000002E-4,2.0599999999999999E-5]
[null,null,null,null,null,null,null,null,null,"Climate Zone 5: West","Uninsulated","Refrigerated Air","Electric Resistance","2x4","Fiberglass batt or cellulose",0.76,2.4,6.5200000000000002E-4,6.78E-4]
[null,null,null,null,null,null,null,null,null,"Climate Zone 5: West","Uninsulated","Refrigerated Air","Heat Pump","2x4","Fiberglass batt or cellulose",0.76,0.98,6.5200000000000002E-4,2.8400000000000002E-4]
[null,null,null,null,null,null,null,null,null,"Climate Zone 5: West","Uninsulated","Evaporative","Gas","2x4","Fiberglass batt or cellulose",0.28999999999999998,0.09,2.0000000000000001E-4,2.0599999999999999E-5]
[null,"High-efficiency Condition:","The standard throughout Texas for adding wall insulation to an existing wall cavity is R-13, as\nprescribed by the United States Department of Energy (DOE) and Texas Department of\nHousing and Community Affairs (TDHCA) programs. The standard is achieved by filling a 2x4\nwall cavity with fiberglass batt or cellulose insulation, which typically provides an R-value per inch (thickness) of between 3 and 4 hr·ft^2·°F/Btu. Other wall insulation materials may be used, such as closed-cell spray foam, which approximately provides R-6 per inch. As such, deemed savings are provided for insulating 2x4 and 2x6 walls to the levels presented in Table 184:\n",null,null,null,null,null,null,"Climate Zone 5: West","Uninsulated","Evaporative","Electric Resistance","2x4","Fiberglass batt or cellulose",0.28999999999999998,2.4,2.0000000000000001E-4,6.78E-4]
[null,null,null,null,null,null,null,null,null,"Climate Zone 5: West","Uninsulated","Evaporative","Heat Pump","2x4","Fiberglass batt or cellulose",0.28999999999999998,0.98,2.0000000000000001E-4,2.8400000000000002E-4]
[null,null,null,null,null,null,null,null,null,"Climate Zone 5: West","Uninsulated","Evaporative","Gas","2x4","Fiberglass batt or cellulose",0.28999999999999998,0.09,2.0000000000000001E-4,2.0599999999999999E-5]
[null,null,null,null,null,null,null,null,null,"Climate Zone 5: West","Uninsulated","Evaporative","Electric Resistance","2x4","Fiberglass batt or cellulose",0.28999999999999998,2.4,2.0000000000000001E-4,6.78E-4]
[null,null,null,null,null,null,null,null,null,"Climate Zone 5: West","Uninsulated","Evaporative","Heat Pump","2x4","Fiberglass batt or cellulose",0.28999999999999998,0.98,2.0000000000000001E-4,2.8400000000000002E-4]
[null,null,null,null,null,null,null,null,null,"Climate Zone 5: West","Minimal (R-4)","Refrigerated Air","Gas","2x4","Fiberglass batt or cellulose",0.28000000000000003,0.03,2.43E-4,6.2299999999999996E-6]
[null,null,null,null,null,null,null,null,null,"Climate Zone 5: West","Minimal (R-4)","Refrigerated Air","Electric Resistance","2x4","Fiberglass batt or cellulose",0.28000000000000003,0.92,2.43E-4,2.23E-4]
[null,null,null,null,null,null,null,null,null,"Climate Zone 5: West","Minimal (R-4)","Refrigerated Air","Heat Pump","2x4","Fiberglass batt or cellulose",0.28000000000000003,0.37,2.43E-4,9.3900000000000006E-5]
[null,null,null,null,null,"Insulation Material","2x4 Wall","2x6 Wall",null,"Climate Zone 5: West","Minimal (R-4)","Refrigerated Air","Gas","2x4","Fiberglass batt or cellulose",0.28000000000000003,0.03,2.43E-4,6.2299999999999996E-6]
[null,"Cooling Type",{"$f":"IF('Wall Insulation'!C5=\"\",\"\",IFERROR(LEFT('Wall Insulation'!C5,SEARCH(\",\",'Wall Insulation'!C5)-1),'Wall Insulation'!C5))","v":""},null,null,"Fiberglass batt or cellulose","R-13","R-17",null,"Climate Zone 5: West","Minimal (R-4)","Refrigerated Air","Electric Resistance","2x4","Fiberglass batt or cellulose",0.28000000000000003,0.92,2.43E-4,2.23E-4]
[null,null,{"$f":"IFERROR(RIGHT('Wall Insulation'!C5,LEN('Wall Insulation'!C5)-SEARCH(\",\",'Wall Insulation'!C5)-1),\"N/A\")","v":"N/A"},null,null,"Closed-cell spray foam","R-21","R-33",null,"Climate Zone 5: West","Minimal (R-4)","Refrigerated Air","Heat Pump","2x4","Fiberglass batt or cellulose",0.28000000000000003,0.37,2.43E-4,9.3900000000000006E-5]
[null,"Heating Type",{"$f":"IF('Wall Insulation'!C6=\"\",\"\",'Wall Insulation'!C6)","v":""},null,null,null,null,null,null,"Climate Zone 5: West","Minimal (R-4)","Evaporative","Gas","2x4","Fiberglass batt or cellulose",0.11,0.03,7.3999999999999996E-5,6.2299999999999996E-6]
[null,"Type of Wall",{"$f":"IF('Wall Insulation'!C7=\"\",\"\",'Wall Insulation'!C7)","v":""},null,null,"Types of Walls",null,null,null,"Climate Zone 5: West","Minimal (R-4)","Evaporative","Electric Resistance","2x4","Fiberglass batt or cellulose",0.11,0.92,7.3999999999999996E-5,2.23E-4]
[null,"Existing Condition",{"$f":"IF('Wall Insulation'!C9=\"\",\"\",'Wall Insulation'!C9)","v":""},null,null,"2x4",null,null,null,"Climate Zone 5: West","Minimal (R-4)","Evaporative","Heat Pump","2x4","Fiberglass batt or cellulose",0.11,0.37,7.3999999999999996E-5,9.3900000000000006E-5]
[null,"New Insulation Material",{"$f":"IF('Wall Insulation'!C10=\"\",\"\",'Wall Insulation'!C10)","v":""},null,null,"2x6",null,null,null,"Climate Zone 5: West","Minimal (R-4)","Evaporative","Gas","2x4","Fiberglass batt or cellulose",0.11,0.03,7.3999999999999996E-5,6.2299999999999996E-6]
[null,"Area (sq.ft.)",{"$f":"IF('Wall Insulation'!C8=\"\",\"\",'Wall Insulation'!C8)","v":""},null,null,null,null,null,null,"Climate Zone 5: West","Minimal (R-4)","Evaporative","Electric Resistance","2x4","Fiberglass batt or cellulose",0.11,0.92,7.3999999999999996E-5,2.23E-4]
[null,null,null,null,null,"Cooling Type",null,null,null,"Climate Zone 5: West","Minimal (R-4)","Evaporative","Heat Pump","2x4","Fiberglass batt or cellulose",0.11,0.37,7.3999999999999996E-5,9.3900000000000006E-5]
[null,"Cooling Savings (kWh)",{"$f":"IF(C20=\"Window Units\",0.6,1)*IF(COUNTBLANK(C19:C25)>0,0,C25*INDEX(P$3:P$98,MATCH(1,($C$19=$L$3:$L$98)*($C$21=$M$3:$M$98)*($C$22=$N$3:$N$98)*($C$23=$K$3:$K$98)*($C$24=$O$3:$O$98),0)))","v":0},null,null,"Refrigerated Air, Central AC",null,null,null,"Climate Zone 5: West","Uninsulated","Refrigerated Air","Gas","2x4","Closed-cell spray foam",0.85,0.1,7.3200000000000001E-4,2.2399999999999999E-5]
[null,"Heating Savings (kWh)",{"$f":"IF(AND(C20=\"Window Units\",C21=\"Electric Resistance\"),0.24,1)*IF(COUNTBLANK(C19:C25)>0,0,C25*INDEX(Q$3:Q$98,MATCH(1,($C$19=$L$3:$L$98)*($C$21=$M$3:$M$98)*($C$22=$N$3:$N$98)*($C$23=$K$3:$K$98)*($C$24=$O$3:$O$98),0)))","v":0},null,null,"Refrigerated Air, Window Units",null,null,null,"Climate Zone 5: West","Uninsulated","Refrigerated Air","Electric Resistance","2x4","Closed-cell spray foam",0.85,2.69,7.3200000000000001E-4,7.3700000000000002E-4]
[null,"Total Savings (kWh)",{"$f":"SUM(C27:C28)","v":0},null,null,"Evaporative",null,null,null,"Climate Zone 5: West","Uninsulated","Refrigerated Air","Heat Pump","2x4","Closed-cell spray foam",0.85,1.0900000000000001,7.3200000000000001E-4,3.1E-4]
[null,null,null,null,null,null,null,null,null,"Climate Zone 5: West","Uninsulated","Refrigerated Air","Gas","2x4","Closed-cell spray foam",0.85,0.1,7.3200000000000001E-4,2.2399999999999999E-5]
[null,"Summer Demand Savings (kW)",{"$f":"IF(C20=\"Window Units\",0.6,1)*IF(COUNTBLANK(C19:C25)>0,0,C25*INDEX(R$3:R$98,MATCH(1,($C$19=$L$3:$L$98)*($C$21=$M$3:$M$98)*($C$22=$N$3:$N$98)*($C$23=$K$3:$K$98)*($C$24=$O$3:$O$98),0)))","v":0},null,null,"Heating Type",null,null,null,"Climate Zone 5: West","Uninsulated","Refrigerated Air","Electric Resistance","2x4","Closed-cell spray foam",0.85,2.69,7.3200000000000001E-4,7.3700000000000002E-4]
[null,"Winter Demand Savings (kW)",{"$f":"IF(AND(C20=\"Window Units\",C21=\"Electric Resistance\"),0.24,1)*IF(COUNTBLANK(C19:C25)>0,0,C25*INDEX(S$3:S$98,MATCH(1,($C$19=$L$3:$L$98)*($C$21=$M$3:$M$98)*($C$22=$N$3:$N$98)*($C$23=$K$3:$K$98)*($C$24=$O$3:$O$98),0)))","v":0},null,null,"Gas",null,null,null,"Climate Zone 5: West","Uninsulated","Refrigerated Air","Heat Pump","2x4","Closed-cell spray foam",0.85,1.0900000000000001,7.3200000000000001E-4,3.1E-4]
[null,null,null,null,null,"Electric Resistance",null,null,null,"Climate Zone 5: West","Uninsulated","Evaporative","Gas","2x4","Closed-cell spray foam",0.33,0.1,2.23E-4,2.2399999999999999E-5]
[null,null,null,null,null,"Heat Pump",null,null,null,"Climate Zone 5: West","Uninsulated","Evaporative","Electric Resistance","2x4","Closed-cell spray foam",0.33,2.69,2.23E-4,7.3700000000000002E-4]
[null,null,null,null,null,null,null,null,null,"Climate Zone 5: West","Uninsulated","Evaporative","Heat Pump","2x4","Closed-cell spray foam",0.33,1.0900000000000001,2.23E-4,3.1E-4]
[null,null,null,null,null,"Existing Condition",null,null,null,"Climate Zone 5: West","Uninsulated","Evaporative","Gas","2x4","Closed-cell spray foam",0.33,0.1,2.23E-4,2.2399999999999999E-5]
[null,null,null,null,null,"Uninsulated",null,null,null,"Climate Zone 5: West","Uninsulated","Evaporative","Electric Resistance","2x4","Closed-cell spray foam",0.33,2.69,2.23E-4,7.3700000000000002E-4]
[null,null,null,null,null,"Minimal (R-4)",null,null,null,"Climate Zone 5: West","Uninsulated","Evaporative","Heat Pump","2x4","Closed-cell spray foam",0.33,1.0900000000000001,2.23E-4,3.1E-4]
[null,null,null,null,null,null,null,null,null,"Climate Zone 5: West","Minimal (R-4)","Refrigerated Air","Gas","2x4","Closed-cell spray foam",0.37,0.05,3.2400000000000001E-4,8.0099999999999995E-6]
[null,null,null,null,null,null,null,null,null,"Climate Zone 5: West","Minimal (R-4)","Refrigerated Air","Electric Resistance","2x4","Closed-cell spray foam",0.37,1.2,3.2400000000000001E-4,2.8299999999999999E-4]
[null,null,null,null,null,null,null,null,null,"Climate Zone 5: West","Minimal (R-4)","Refrigerated Air","Heat Pump","2x4","Closed-cell spray foam",0.37,0.49,3.2400000000000001E-4,1.2E-4]
[null,null,null,null,null,null,null,null,null,"Climate Zone 5: West","Minimal (R-4)","Refrigerated Air","Gas","2x4","Closed-cell spray foam",0.37,0.05,3.2400000000000001E-4,8.0099999999999995E-6]
[null,null,null,null,null,null,null,null,null,"Climate Zone 5: West","Minimal (R-4)","Refrigerated Air","Electric Resistance","2x4","Closed-cell spray foam",0.37,1.2,3.2400000000000001E-4,2.8299999999999999E-4]
[null,null,null,null,null,null,null,null,null,"Climate Zone 5: West","Minimal (R-4)","Refrigerated Air","Heat Pump","2x4","Closed-cell spray foam",0.37,0.49,3.2400000000000001E-4,1.2E-4]
[null,null,null,null,null,null,null,null,null,"Climate Zone 5: West","Minimal (R-4)","Evaporative","Gas","2x4","Closed-cell spray foam",0.14000000000000001,0.05,9.6799999999999995E-5,8.0099999999999995E-6]
[null,null,null,null,null,null,null,null,null,"Climate Zone 5: West","Minimal (R-4)","Evaporative","Electric Resistance","2x4","Closed-cell spray foam",0.14000000000000001,1.2,9.6799999999999995E-5,2.8299999999999999E-4]
[null,null,null,null,null,null,null,null,null,"Climate Zone 5: West","Minimal (R-4)","Evaporative","Heat Pump","2x4","Closed-cell spray foam",0.14000000000000001,0.49,9.6799999999999995E-5,1.2E-4]
[null,null,null,null,null,null,null,null,null,"Climate Zone 5: West","Minimal (R-4)","Evaporative","Gas","2x4","Closed-cell spray foam",0.14000000000000001,0.05,9.6799999999999995E-5,8.0099999999999995E-6]
[null,null,null,null,null,null,null,null,null,"Climate Zone 5: West","Minimal (R-4)","Evaporative","Electric Resistance","2x4","Closed-cell spray foam",0.14000000000000001,1.2,9.6799999999999995E-5,2.8299999999999999E-4]
[null,null,null,null,null,null,null,null,null,"Climate Zone 5: West","Minimal (R-4)","Evaporative","Heat Pump","2x4","Closed-cell spray foam",0.14000000000000001,0.49,9.6799999999999995E-5,1.2E-4]
[null,null,null,null,null,null,null,null,null,"Climate Zone 5: West","Uninsulated","Refrigerated Air","Gas","2x6","Fiberglass batt or cellulose",0.81,0.1,7.0600000000000003E-4,1.84E-5]
[null,null,null,null,null,null,null,null,null,"Climate Zone 5: West","Uninsulated","Refrigerated Air","Electric Resistance","2x6","Fiberglass batt or cellulose",0.81,2.58,7.0600000000000003E-4,6.2399999999999999E-4]
[null,null,null,null,null,null,null,null,null,"Climate Zone 5: West","Uninsulated","Refrigerated Air","Heat Pump","2x6","Fiberglass batt or cellulose",0.81,1.05,7.0600000000000003E-4,2.6400000000000002E-4]
[null,null,null,null,null,null,null,null,null,"Climate Zone 5: West","Uninsulated","Refrigerated Air","Gas","2x6","Fiberglass batt or cellulose",0.81,0.1,7.0600000000000003E-4,1.84E-5]
[null,null,null,null,null,null,null,null,null,"Climate Zone 5: West","Uninsulated","Refrigerated Air","Electric Resistance","2x6","Fiberglass batt or cellulose",0.81,2.58,7.0600000000000003E-4,6.2399999999999999E-4]
[null,null,null,null,null,null,null,null,null,"Climate Zone 5: West","Uninsulated","Refrigerated Air","Heat Pump","2x6","Fiberglass batt or cellulose",0.81,1.05,7.0600000000000003E-4,2.6400000000000002E-4]
[null,null,null,null,null,null,null,null,null,"Climate Zone 5: West","Uninsulated","Evaporative","Gas","2x6","Fiberglass batt or cellulose",0.31,0.1,2.14E-4,1.84E-5]
[null,null,null,null,null,null,null,null,null,"Climate Zone 5: West","Uninsulated","Evaporative","Electric Resistance","2x6","Fiberglass batt or cellulose",0.31,2.58,2.14E-4,6.2399999999999999E-4]
[null,null,null,null,null,null,null,null,null,"Climate Zone 5: West","Uninsulated","Evaporative","Heat Pump","2x6","Fiberglass batt or cellulose",0.31,1.05,2.14E-4,2.6400000000000002E-4]
[null,null,null,null,null,null,null,null,null,"Climate Zone 5: West","Uninsulated","Evaporative","Gas","2x6","Fiberglass batt or cellulose",0.31,0.1,2.14E-4,1.84E-5]
[null,null,null,null,null,null,null,null,null,"Climate Zone 5: West","Uninsulated","Evaporative","Electric Resistance","2x6","Fiberglass batt or cellulose",0.31,2.58,2.14E-4,6.2399999999999999E-4]
[null,null,null,null,null,null,null,null,null,"Climate Zone 5: West","Uninsulated","Evaporative","Heat Pump","2x6","Fiberglass batt or cellulose",0.31,1.05,2.14E-4,2.6400000000000002E-4]
[null,null,null,null,null,null,null,null,null,"Climate Zone 5: West","Minimal (R-4)","Refrigerated Air","Gas","2x6","Fiberglass batt or cellulose",0.33,0.04,2.9100000000000003E-4,5.5899999999999998E-6]
[null,null,null,null,null,null,null,null,null,"Climate Zone 5: West","Minimal (R-4)","Refrigerated Air","Electric Resistance","2x6","Fiberglass batt or cellulose",0.33,1.08,2.9100000000000003E-4,2.0599999999999999E-4]
[null,null,null,null,null,null,null,null,null,"Climate Zone 5: West","Minimal (R-4)","Refrigerated Air","Heat Pump","2x6","Fiberglass batt or cellulose",0.33,0.44,2.9100000000000003E-4,8.81E-5]
[null,null,null,null,null,null,null,null,null,"Climate Zone 5: West","Minimal (R-4)","Refrigerated Air","Gas","2x6","Fiberglass batt or cellulose",0.33,0.04,2.9100000000000003E-4,5.5899999999999998E-6]
[null,null,null,null,null,null,null,null,null,"Climate Zone 5: West","Minimal (R-4)","Refrigerated Air","Electric Resistance","2x6","Fiberglass batt or cellulose",0.33,1.08,2.9100000000000003E-4,2.0599999999999999E-4]
[null,null,null,null,null,null,null,null,null,"Climate Zone 5: West","Minimal (R-4)","Refrigerated Air","Heat Pump","2x6","Fiberglass batt or cellulose",0.33,0.44,2.9100000000000003E-4,8.81E-5]
[null,null,null,null,null,null,null,null,null,"Climate Zone 5: West","Minimal (R-4)","Evaporative","Gas","2x6","Fiberglass batt or cellulose",0.13,0.04,8.4400000000000005E-5,5.5899999999999998E-6]
[null,null,null,null,null,null,null,null,null,"Climate Zone 5: West","Minimal (R-4)","Evaporative","Electric Resistance","2x6","Fiberglass batt or cellulose",0.13,1.08,8.4400000000000005E-5,2.0599999999999999E-4]
[null,null,null,null,null,null,null,null,null,"Climate Zone 5: West","Minimal (R-4)","Evaporative","Heat Pump","2x6","Fiberglass batt or cellulose",0.13,0.44,8.4400000000000005E-5,8.81E-5]
[null,null,null,null,null,null,null,null,null,"Climate Zone 5: West","Minimal (R-4)","Evaporative","Gas","2x6","Fiberglass batt or cellulose",0.13,0.04,8.4400000000000005E-5,5.5899999999999998E-6]
[null,null,null,null,null,null,null,null,null,"Climate Zone 5: West","Minimal (R-4)","Evaporative","Electric Resistance","2x6","Fiberglass batt or cellulose",0.13,1.08,8.4400000000000005E-5,2.0599999999999999E-4]
[null,null,null,null,null,null,null,null,null,"Climate Zone 5: West","Minimal (R-4)","Evaporative","Heat Pump","2x6","Fiberglass batt or cellulose",0.13,0.44,8.4400000000000005E-5,8.81E-5]
[null,null,null,null,null,null,null,null,null,"Climate Zone 5: West","Uninsulated","Refrigerated Air","Gas","2x6","Closed-cell spray foam",0.9,0.11,7.7999999999999999E-4,1.9599999999999999E-5]
[null,null,null,null,null,null,null,null,null,"Climate Zone 5: West","Uninsulated","Refrigerated Air","Electric Resistance","2x6","Closed-cell spray foam",0.9,2.88,7.7999999999999999E-4,6.6600000000000003E-4]
[null,null,null,null,null,null,null,null,null,"Climate Zone 5: West","Uninsulated","Refrigerated Air","Heat Pump","2x6","Closed-cell spray foam",0.9,1.17,7.7999999999999999E-4,2.8200000000000002E-4]
[null,null,null,null,null,null,null,null,null,"Climate Zone 5: West","Uninsulated","Refrigerated Air","Gas","2x6","Closed-cell spray foam",0.9,0.11,7.7999999999999999E-4,1.9599999999999999E-5]
[null,null,null,null,null,null,null,null,null,"Climate Zone 5: West","Uninsulated","Refrigerated Air","Electric Resistance","2x6","Closed-cell spray foam",0.9,2.88,7.7999999999999999E-4,6.6600000000000003E-4]
[null,null,null,null,null,null,null,null,null,"Climate Zone 5: West","Uninsulated","Refrigerated Air","Heat Pump","2x6","Closed-cell spray foam",0.9,1.17,7.7999999999999999E-4,2.8200000000000002E-4]
[null,null,null,null,null,null,null,null,null,"Climate Zone 5: West","Uninsulated","Evaporative","Gas","2x6","Closed-cell spray foam",0.35,0.11,2.3800000000000001E-4,1.9599999999999999E-5]
[null,null,null,null,null,null,null,null,null,"Climate Zone 5: West","Uninsulated","Evaporative","Electric Resistance","2x6","Closed-cell spray foam",0.35,2.88,2.3800000000000001E-4,6.6600000000000003E-4]
[null,null,null,null,null,null,null,null,null,"Climate Zone 5: West","Uninsulated","Evaporative","Heat Pump","2x6","Closed-cell spray foam",0.35,1.17,2.3800000000000001E-4,2.8200000000000002E-4]
[null,null,null,null,null,null,null,null,null,"Climate Zone 5: West","Uninsulated","Evaporative","Gas","2x6","Closed-cell spray foam",0.35,0.11,2.3800000000000001E-4,1.9599999999999999E-5]
[null,null,null,null,null,null,null,null,null,"Climate Zone 5: West","Uninsulated","Evaporative","Electric Resistance","2x6","Closed-cell spray foam",0.35,2.88,2.3800000000000001E-4,6.6600000000000003E-4]
[null,null,null,null,null,null,null,null,null,"Climate Zone 5: West","Uninsulated","Evaporative","Heat Pump","2x6","Closed-cell spray foam",0.35,1.17,2.3800000000000001E-4,2.8200000000000002E-4]
[null,null,null,null,null,null,null,null,null,"Climate Zone 5: West","Minimal (R-4)","Refrigerated Air","Gas","2x6","Closed-cell spray foam",0.42,0.05,3.6499999999999998E-4,6.8700000000000003E-6]
[null,null,null,null,null,null,null,null,null,"Climate Zone 5: West","Minimal (R-4)","Refrigerated Air","Electric Resistance","2x6","Closed-cell spray foam",0.42,1.38,3.6499999999999998E-4,2.4800000000000001E-4]
[null,null,null,null,null,null,null,null,null,"Climate Zone 5: West","Minimal (R-4)","Refrigerated Air","Heat Pump","2x6","Closed-cell spray foam",0.42,0.56000000000000005,3.6499999999999998E-4,1.06E-4]
[null,null,null,null,null,null,null,null,null,"Climate Zone 5: West","Minimal (R-4)","Refrigerated Air","Gas","2x6","Closed-cell spray foam",0.42,0.05,3.6499999999999998E-4,6.8700000000000003E-6]
[null,null,null,null,null,null,null,null,null,"Climate Zone 5: West","Minimal (R-4)","Refrigerated Air","Electric Resistance","2x6","Closed-cell spray foam",0.42,1.38,3.6499999999999998E-4,2.4800000000000001E-4]
[null,null,null,null,null,null,null,null,null,"Climate Zone 5: West","Minimal (R-4)","Refrigerated Air","Heat Pump","2x6","Closed-cell spray foam",0.42,0.56000000000000005,3.6499999999999998E-4,1.06E-4]
[null,null,null,null,null,null,null,null,null,"Climate Zone 5: West","Minimal (R-4)","Evaporative","Gas","2x6","Closed-cell spray foam",0.16,0.05,1.08E-4,6.8700000000000003E-6]
[null,null,null,null,null,null,null,null,null,"Climate Zone 5: West","Minimal (R-4)","Evaporative","Electric Resistance","2x6","Closed-cell spray foam",0.16,1.38,1.08E-4,2.4800000000000001E-4]
[null,null,null,null,null,null,null,null,null,"Climate Zone 5: West","Minimal (R-4)","Evaporative","Heat Pump","2x6","Closed-cell spray foam",0.16,0.56000000000000005,1.08E-4,1.06E-4]
[null,null,null,null,null,null,null,null,null,"Climate Zone 5: West","Minimal (R-4)","Evaporative","Gas","2x6","Closed-cell spray foam",0.16,0.05,1.08E-4,6.8700000000000003E-6]
[null,null,null,null,null,null,null,null,null,"Climate Zone 5: West","Minimal (R-4)","Evaporative","Electric Resistance","2x6","Closed-cell spray foam",0.16,1.38,1.08E-4,2.4800000000000001E-4]
[null,null,null,null,null,null,null,null,null,"Climate Zone 5: West","Minimal (R-4)","Evaporative","Heat Pump","2x6","Closed-cell spray foam",0.16,0.56000000000000005,1.08E-4,1.06E-4]

{"sheet":"Floor Insulation","index":13,"n_rows":12,"n_cols":4,"rows_kept":12,"cut":false,"hidden":true,"merged":[[1,1,1,3],[2,1,2,3]]}
[]
[null,"Floor Insulation"]
[null,"Instructions: Enter the project information in the yellow cells below."]
[]
[null,"Home Type"]
[null,"Cooling Type"]
[null,"Heating Type"]
[null,"Floor Area",null,"sq ft"]
[]
[null,"Energy Savings",{"$f":"'Floor Insulation Lookup'!C27","v":0},"kWh"]
[null,{"$f":"IF('Floor Insulation Lookup'!C29=C11,\"Summer\",\"Winter\")&\" Peak Demand Savings\"","v":"Summer Peak Demand Savings"},{"$f":"MAX('Floor Insulation Lookup'!C29:C30)","v":0},"kW"]
[null,"Incentive",{"$f":"Incentive_Rate*C11","v":0}]

{"sheet":"Floor Insulation Lookup","index":14,"n_rows":30,"n_cols":12,"rows_kept":30,"cut":false,"hidden":true,"merged":[[1,2,3,5],[5,2,15,5]]}
[]
[null,"Baseline Condition:","The baseline is considered to be a house with pier and beam construction and no floor insulation against the floor of the conditioned area. "]
[null,null,null,null,null,null,null,"Climate Zone","Home Type","Type","Energy Savings/sf","Demand Savings/sf"]
[null,null,null,null,null,null,null,"Climate Zone 5: West","Site-built Home","Refrigerated Air",-0.16,6.2899999999999999E-6]
[null,null,null,null,null,null,null,"Climate Zone 5: West","Site-built Home","Evaporative",-7.0000000000000007E-2,-1.3400000000000001E-6]
[null,"High-efficiency Condition:","A floor insulation level of R-19 is recommended for site-built homes throughout Texas as prescribed by DOE and Texas Department of Housing and Community Affairs (TDHCA) programs. Batt insulation is recommended in most cases and must have the vapor barrier installed facing up and against the floor or conditioned area. Insulation should be attached or secured so that it can reasonably be expected to remain in place for at least 10 years. Typical floor construction depth of manufactured homes usually does not allow R-19 batt to be installed within the floor joists, so R-15 loose-fill insulation is recommended by TDHCA. A minimum of 24-inch clearance from the bottom of the insulation to the ground is required by the Occupational Safety and Health Association (OSHA).",null,null,null,null,"Climate Zone 5: West","Manufactured Home","Refrigerated Air",-0.13,8.2999999999999999E-7]
[null,null,null,null,null,null,null,"Climate Zone 5: West","Manufactured Home","Evaporative",-0.06,1.85E-7]
[null,null,null,null,null,null,null,"Climate Zone 5: West","Site-built Home","Electric Resistance",1.1000000000000001,3.5399999999999999E-4]
[null,null,null,null,null,null,null,"Climate Zone 5: West","Site-built Home","Heat Pump",0.43,1.44E-4]
[null,null,null,null,null,null,null,"Climate Zone 5: West","Site-built Home","Gas",0,0]
[null,null,null,null,null,null,null,"Climate Zone 5: West","Manufactured Home","Electric Resistance",0.97,3.19E-4]
[null,null,null,null,null,null,null,"Climate Zone 5: West","Manufactured Home","Heat Pump",0.38,1.2999999999999999E-4]
[null,null,null,null,null,null,null,"Climate Zone 5: West","Manufactured Home","Gas",0,0]
[]
[]
[]
[]
[]
[null,"Home Type",{"$f":"IF('Floor Insulation'!C5=\"\",\"\",'Floor Insulation'!C5)","v":""},null,null,"Home Types"]
[null,"Cooling Type",{"$f":"IF('Floor Insulation'!C6=\"\",\"\",IFERROR(LEFT('Floor Insulation'!C6,SEARCH(\",\",'Floor Insulation'!C6)-1),'Floor Insulation'!C6))","v":""},null,null,"Site-built Home"]
[null,null,{"$f":"IFERROR(RIGHT('Floor Insulation'!C6,LEN('Floor Insulation'!C6)-SEARCH(\",\",'Floor Insulation'!C6)-1),\"N/A\")","v":"N/A"},null,null,"Manufactured Home"]
[null,"Heating Type",{"$f":"IF('Floor Insulation'!C7=\"\",\"\",'Floor Insulation'!C7)","v":""}]
[null,"Area (sq.ft.)",{"$f":"IF('Floor Insulation'!C8=\"\",\"\",'Floor Insulation'!C8)","v":""}]
[]
[null,"Cooling Savings (kWh)",{"$f":"IF(C21=\"Window Units\",0.6,1)*IF(COUNTBLANK(C19:C23)>0,0,C23*INDEX(K4:K13,MATCH(1,(C19=I4:I13)*(C20=J4:J13),0)))","v":0}]
[null,"Heating Savings (kWh)",{"$f":"IF(AND(C20=\"Window Units\",C21=\"Electric Resistance\"),0.24,1)*IF(COUNTBLANK(C19:C23)>0,0,C23*INDEX(K4:K13,MATCH(1,(C19=I4:I13)*(C22=J4:J13),0)))","v":0}]
[null,"Total Savings (kWh)",{"$f":"SUM(C25:C26)","v":0}]
[]
[null,"Summer Demand Savings (kW)",{"$f":"IF(C21=\"Window Units\",0.6,1)*IF(COUNTBLANK(C19:C23)>0,0,C23*INDEX(L4:L13,MATCH(1,(C19=I4:I13)*(C20=J4:J13),0)))","v":0}]
[null,"Winter Demand Savings (kW)",{"$f":"IF(AND(C20=\"Window Units\",C21=\"Electric Resistance\"),0.24,1)*IF(COUNTBLANK(C19:C23)>0,0,C23*INDEX(L4:L13,MATCH(1,(C19=I4:I13)*(C22=J4:J13),0)))","v":0}]

{"sheet":"Air Infiltration","index":15,"n_rows":13,"n_cols":4,"rows_kept":13,"cut":false,"hidden":true,"merged":[[1,1,1,3],[2,1,2,3]]}
[]
[null,"Air Infiltration"]
[null,"Instructions: Enter the project information in the yellow cells below."]
[]
[null,"Cooling Type"]
[null,"Heating Type"]
[null,"Square Footage",null,"FT2"]
[null,"Initial Leakage Rate",null,"CFM50"]
[null,"Post Leakage Rate",null,"CFM50"]
[]
[null,"Energy Savings",{"$f":"'Air Infiltration Lookup'!C34","v":0},"kWh"]
[null,{"$f":"IF('Air Infiltration Lookup'!C36=C12,\"Summer\",\"Winter\")&\" Peak Demand Savings\"","v":"Summer Peak Demand Savings"},{"$f":"MAX('Air Infiltration Lookup'!C36:C37)","v":0},"kW"]
[null,"Incentive",{"$f":"Incentive_Rate*C12","v":0}]

{"sheet":"Air Infiltration Lookup","index":16,"n_rows":37,"n_cols":11,"rows_kept":37,"cut":false,"hidden":true,"merged":[[1,2,3,5],[5,2,15,5],[12,8,12,10]]}
[]
[null,"Baseline Condition:","The baseline for this measure is the existing leakage rate of the treated residence. The existing leakage rate should be capped to account for the fact that the deemed savings values per CFM50 leakage reduction are only applicable up to a point where the existing HVAC equipment would run continuously. Beyond that point, energy use will no longer increase linearly with an increase in leakage."]
[null,null,null,null,null,null,null,"Climate Zone","Type","Energy Savings/CFM50","Demand Savings/CFM50"]
[null,null,null,null,null,null,null,"Climate Zone 5: West","Refrigerated Air",7.0000000000000007E-2,9.3999999999999994E-5]
[null,null,null,null,null,null,null,"Climate Zone 5: West","Evaporative",0,0]
[null,"High-efficiency Condition:","Blower door air pressure measurements must also be used to ensure that post-treatment air infiltration rates are not less than those set forth by the standard in Equation 54, based on floor area and the number of bedrooms.206 These calculated minimum CFM50 values assume two occupants for a one-bedroom dwelling unit and an additional person for each additional bedroom. At the utility’s discretion, this minimum CFM50 requirement may be enforced as an eligibility requirement. Otherwise, savings may be claimed for projects where the measured final infiltration rate is less than the minimum allowable ventilation rate if the following conditions are met:\n• Mechanical ventilation is present or introduced in compliance with ASHRAE 62.2-2019\n• Post-treatment infiltration rate is reported as the actual measured CFM50 result\n• Savings are calculated using the TRM minimum allowable ventilation rate with no additional savings claimed for CFM reduction below this amount",null,null,null,null,"Climate Zone 5: West","Electric Resistance",0.88,2.92E-4]
[null,null,null,null,null,null,null,"Climate Zone 5: West","Heat Pump",0.34,1.1900000000000001E-4]
[null,null,null,null,null,null,null,"Climate Zone 5: West","Gas",0.03,0]
[]
[]
[]
[]
[null,null,null,null,null,null,null,"N-Factors","Number of Stories"]
[null,null,null,null,null,null,null,"Shielding",1,2,"3+"]
[null,null,null,null,null,null,null,"Well Shielded",22.2,17.8,15.5]
[null,null,null,null,null,null,null,"Normal",18.5,14.8,13]
[null,null,null,null,null,null,null,"Exposed",16.7,13.3,11.7]
[]
[null,"Cooling Type",{"$f":"IF('Air Infiltration'!C5=\"\",\"\",IFERROR(LEFT('Air Infiltration'!C5,SEARCH(\",\",'Air Infiltration'!C5)-1),'Air Infiltration'!C5))","v":""}]
[null,null,{"$f":"IFERROR(RIGHT('Air Infiltration'!C5,LEN('Air Infiltration'!C5)-SEARCH(\",\",'Air Infiltration'!C5)-1),\"N/A\")","v":"N/A"}]
[null,"Heating Type",{"$f":"IF('Air Infiltration'!C6=\"\",\"\",'Air Infiltration'!C6)","v":""}]
[null,"Square Footage",{"$f":"'Air Infiltration'!C7","v":0}]
[null,"Initial Leakage Rate",{"$f":"'Air Infiltration'!C8","v":0}]
[null,"Post Leakage Rate",{"$f":"'Air Infiltration'!C9","v":0}]
[]
[null,"Max Initial Leakage Rate",{"$f":"4.6*C22","v":0}]
[null,"Reported Initial Leakage Rate",{"$f":"IFERROR(MIN(C23,C26),C26)","v":0}]
[null,"Capped Post Retrofit Leakage",{"$f":"C27*0.7","v":0}]
[null,"Reported Post Retrofit Leakage",{"$f":"IFERROR(MAX(C28,C24),C28)","v":0}]
[null,"ΔCFM50",{"$f":"C27-C29","v":0}]
[]
[null,"Cooling Savings (kWh)",{"$f":"IF(C20=\"Window Units\",0.6,1)*IF(COUNTBLANK(C19:C24)>0,0,C30*INDEX(J4:J8,MATCH(C19,I4:I8,0)))","v":0}]
[null,"Heating Savings (kWh)",{"$f":"IF(AND(C20=\"Window Units\",C21=\"Electric Resistance\"),0.24,1)*IF(COUNTBLANK(C19:C24)>0,0,C30*INDEX(J4:J8,MATCH(C21,I4:I8,0)))","v":0}]
[null,"Total Savings (kWh)",{"$f":"SUM(C32:C33)","v":0}]
[]
[null,"Summer Demand Savings (kW)",{"$f":"IF(C20=\"Window Units\",0.6,1)*IF(COUNTBLANK(C19:C24)>0,0,C30*INDEX(K4:K8,MATCH(C19,I4:I8,0)))","v":0}]
[null,"Winter Demand Savings (kW)",{"$f":"IF(AND(C20=\"Window Units\",C21=\"Electric Resistance\"),0.24,1)*IF(COUNTBLANK(C19:C24)>0,0,C30*INDEX(K4:K8,MATCH(C21,I4:I8,0)))","v":0}]

{"sheet":"Cool Roofs","index":17,"n_rows":15,"n_cols":4,"rows_kept":15,"cut":false,"hidden":true,"merged":[[1,1,1,3],[2,1,2,3]]}
[]
[null,"Cool Roofs"]
[null,"Instructions: Enter the project information in the yellow cells below."]
[]
[null,"Cooling Type"]
[null,"Heating Type"]
[null,"Insulation Type"]
[null,"Insulation R-Value"]
[null,"Roof Slope"]
[null,"Roof Area",null,"sq ft"]
[null,"New Roof 3-year Reflectance"]
[]
[null,"Energy Savings",{"$f":"'Cool Roofs Lookup'!C32","v":0},"kWh"]
[null,{"$f":"IF('Cool Roofs Lookup'!C34=C14,\"Summer\",\"Winter\")&\" Peak Demand Savings\"","v":"Summer Peak Demand Savings"},{"$f":"MAX('Cool Roofs Lookup'!C34:C35)","v":0},"kW"]
[null,"Incentive",{"$f":"Incentive_Rate*C14","v":0}]

{"sheet":"Cool Roofs Lookup","index":18,"n_rows":46,"n_cols":21,"rows_kept":46,"cut":false,"hidden":true,"merged":[[2,16,2,17],[2,18,2,20],[1,2,3,5],[5,2,15,5],[2,10,3,10],[2,11,2,12],[2,13,2,15]]}
[]
[null,"Baseline Condition:","The baseline condition is an existing home with a standard medium- or dark-colored roof.",null,null,null,null,null,null,null,null,"Energy Savings",null,null,null,null,"Demand Savings"]
[null,null,null,null,null,null,null,null,null,"Insulation","Installed Roof Material 3-Year Reflectance","Cooling Savings",null,"Heating Savings",null,null,"Summer",null,"Winter"]
[null,null,null,null,null,null,null,"Insulation Type","Roof Slope]","R-value",null,"Refrigerated Air","Evaporative Cooling","Gas","Electric Resistance","Heat Pump","Refrigerated Air","Evaporative Cooling","Gas","Electric Resistance","Heat Pump"]
[null,null,null,null,null,null,null,"Ceiling","Steep","≤ R-8","0.15 - 0.29",0.04,0.02,0,-0.04,-0.01,2.72E-5,8.9600000000000006E-6,-2.41E-7,-1.98E-5,-7.9799999999999998E-6]
[null,"High-efficiency Condition:","The measure requires installation of roof products that have been rated by the Cool Roof Rating Council (CRRC) and demonstrate compliance with ENERGY STAR® certified roof product performance specifications for the relevant roof application. ENERGY STAR® test criteria allows for products already participating in the CRRC Product Rating Program to submit solar reflectance and thermal emittance product information derived from CRRC certification.",null,null,null,null,"Ceiling","Steep","≤ R-8","0.3 – 0.49",0.21,0.08,-0.01,-0.2,-7.0000000000000007E-2,1.27E-4,6.0000000000000002E-5,-4.8300000000000003E-6,-1.03E-4,-4.1399999999999997E-5]
[null,null,null,null,null,null,null,"Ceiling","Steep","≤ R-8","0.5 – 0.69",0.39,0.15,-0.02,-0.38,-0.14000000000000001,2.5900000000000001E-4,1.3799999999999999E-4,-1.22E-5,-1.9900000000000001E-4,-7.9699999999999999E-5]
[null,null,null,null,null,null,null,"Ceiling","Steep","≤ R-8",">= 0.7",0.57999999999999996,0.23,-0.03,-0.59,-0.22,3.97E-4,1.7799999999999999E-4,-1.73E-5,-3.1100000000000002E-4,-1.2799999999999999E-4]
[null,null,null,null,null,null,null,"Ceiling","Steep","R-9 to R-14","0.15 - 0.29",0.03,0.01,0,-0.03,-0.01,1.2500000000000001E-5,9.2599999999999994E-6,-5.7700000000000004E-7,-1.3499999999999999E-5,-5.48E-6]
[null,null,null,null,null,null,null,"Ceiling","Steep","R-9 to R-14","0.3 – 0.49",0.15,0.06,-0.01,-0.14000000000000001,-0.05,8.2399999999999997E-5,5.3000000000000001E-5,-4.07E-6,-7.5599999999999994E-5,-3.15E-5]
[null,null,null,null,null,null,null,"Ceiling","Steep","R-9 to R-14","0.5 – 0.69",0.27,0.11,-0.01,-0.27,-0.1,1.73E-4,8.8599999999999999E-5,-9.6600000000000007E-6,-1.44E-4,-5.7599999999999997E-5]
[null,null,null,null,null,null,null,"Ceiling","Steep","R-9 to R-14",">= 0.7",0.41,0.16,-0.02,-0.41,-0.15,2.5999999999999998E-4,1.22E-4,-1.38E-5,-2.33E-4,-9.6600000000000003E-5]
[null,null,null,null,null,null,null,"Ceiling","Steep","R-15 to R-22","0.15 - 0.29",0.02,0.01,0,-0.02,-0.01,6.1600000000000003E-6,3.7299999999999999E-6,-4.2899999999999999E-7,-9.4099999999999997E-6,-4.1999999999999996E-6]
[null,null,null,null,null,null,null,"Ceiling","Steep","R-15 to R-22","0.3 – 0.49",0.1,0.04,-0.01,-0.1,-0.04,6.1799999999999998E-5,4.3999999999999999E-5,-3.14E-6,-4.9100000000000001E-5,-2.0000000000000002E-5]
[null,null,null,null,null,null,null,"Ceiling","Steep","R-15 to R-22","0.5 – 0.69",0.19,0.08,-0.01,-0.18,-7.0000000000000007E-2,1.2400000000000001E-4,6.4900000000000005E-5,-7.7000000000000008E-6,-9.7100000000000002E-5,-4.0200000000000001E-5]
[null,null,null,null,null,null,null,"Ceiling","Steep","R-15 to R-22",">= 0.7","7xfmc",0.12,-0.02,-0.28000000000000003,-0.1,1.8799999999999999E-4,8.8599999999999999E-5,-1.0499999999999999E-5,-1.55E-4,-6.2899999999999997E-5]
[null,null,null,null,null,null,null,"Ceiling","Steep","R-22 to R-30","0.15 - 0.29",0.01,0.01,0,-0.01,-0.01,6.64E-6,5.6499999999999999E-7,-2.8500000000000002E-7,-6.2600000000000002E-6,-2.5399999999999998E-6]
[null,null,null,null,null,null,null,"Ceiling","Steep","R-22 to R-30","0.3 – 0.49",7.0000000000000007E-2,0.03,0,-0.06,-0.02,4.7700000000000001E-5,2.87E-5,-2.3199999999999998E-6,-3.1099999999999997E-5,-1.2500000000000001E-5]
[null,"Cooling Type",{"$f":"IF('Cool Roofs'!C5=\"\",\"\",IFERROR(LEFT('Cool Roofs'!C5,SEARCH(\",\",'Cool Roofs'!C5)-1),'Cool Roofs'!C5))","v":""},null,null,"RoofSlope",null,"Ceiling","Steep","R-22 to R-30","0.5 – 0.69",0.13,0.05,-0.01,-0.12,-0.04,8.81E-5,5.0699999999999999E-5,-6.0100000000000001E-6,-5.9700000000000001E-5,-2.4600000000000002E-5]
[null,null,{"$f":"IFERROR(RIGHT('Cool Roofs'!C5,LEN('Cool Roofs'!C5)-SEARCH(\",\",'Cool Roofs'!C5)-1),\"N/A\")","v":"N/A"},null,null,"Steep",null,"Ceiling","Steep","R-22 to R-30",">= 0.7",0.2,0.08,-0.01,-0.18,-7.0000000000000007E-2,1.3200000000000001E-4,6.7500000000000001E-5,-7.7800000000000001E-6,-9.6899999999999997E-5,-3.9799999999999998E-5]
[null,"Heating Type",{"$f":"IF('Cool Roofs'!C6=\"\",\"\",'Cool Roofs'!C6)","v":""},null,null,"Low",null,"Ceiling","Low","≤ R-8","0.5 – 0.69",0.45,0.18,-0.02,-0.44,-0.16,3.0600000000000001E-4,1.34E-4,-1.33E-5,-2.3599999999999999E-4,-9.4400000000000004E-5]
[null,"Insulation Type",{"$f":"'Cool Roofs'!C7","v":0},null,null,null,null,"Ceiling","Low","≤ R-8",">= 0.7",0.66,0.26,-0.03,-0.68,-0.25,4.7699999999999999E-4,2.05E-4,-1.47E-5,-3.6400000000000001E-4,-1.4799999999999999E-4]
[null,"Insulation R-Value",{"$f":"'Cool Roofs'!C8","v":0},null,null,"3-Yr Reflectance",null,"Ceiling","Low","R-9 to R-14","0.5 – 0.69",0.32,0.13,-0.02,-0.31,-0.12,2.0699999999999999E-4,1E-4,-9.5200000000000003E-6,-1.7000000000000001E-4,-6.8300000000000007E-5]
[null,"Roof Slope",{"$f":"'Cool Roofs'!C9","v":0},null,null,"0.15 - 0.29",null,"Ceiling","Low","R-9 to R-14",">= 0.7",0.47,0.19,-0.03,-0.47,-0.18,3.2699999999999998E-4,1.44E-4,-1.06E-5,-2.7300000000000002E-4,-1.12E-4]
[null,"Roof Area",{"$f":"'Cool Roofs'!C10","v":0},null,null,"0.3 – 0.49",null,"Ceiling","Low","R-15 to R-22","0.5 – 0.69",0.23,0.09,-0.01,-0.21,-0.08,1.4999999999999999E-4,7.6299999999999998E-5,-7.5499999999999997E-6,-1.1400000000000001E-4,-4.6600000000000001E-5]
[null,"New Roof 3-year Reflectance",{"$f":"'Cool Roofs'!C11","v":0},null,null,"0.5 – 0.69",null,"Ceiling","Low","R-15 to R-22",">= 0.7",0.34,0.14000000000000001,-0.02,-0.32,-0.12,2.42E-4,1.11E-4,-8.9400000000000008E-6,-1.85E-4,-7.4300000000000004E-5]
[null,null,null,null,null,">= 0.7",null,"Ceiling","Low","R-22 to R-30","0.5 – 0.69",0.17,7.0000000000000007E-2,-0.01,-0.14000000000000001,-0.06,1.01E-4,5.91E-5,-5.5199999999999997E-6,-7.4400000000000006E-5,-2.9499999999999999E-5]
[null,"Row Index",{"$f":"MATCH(1,(C22=H5:H46)*(C24=I5:I46)*(C23=J5:J46)*(C26=K5:K46),0)","v":{"$error":"#N/A"}},null,null,null,null,"Ceiling","Low","R-22 to R-30",">= 0.7",0.25,0.1,-0.02,-0.22,-0.08,1.8000000000000001E-4,8.5000000000000006E-5,-7.7300000000000005E-6,-1.2E-4,-4.8900000000000003E-5]
[null,null,null,null,null,"InsulationType",null,"Roof Deck","Steep","R-19","0.15 - 0.29",0,0,0,0,0,0,0,0,0,0]
[null,"Cooling Savings (kWh)",{"$f":"IF(C20=\"Window Units\",0.6,1)*IF(COUNTBLANK(C19:C26)>0,0,C25*INDEX(L5:M46,C28,MATCH(C19,L4:M4,0)))","v":0},null,null,"Ceiling",null,"Roof Deck","Steep","R-19","0.3 – 0.49",0.11,0.04,-0.01,-0.14000000000000001,-0.05,3.6399999999999997E-5,2.2399999999999999E-5,2.0700000000000001E-6,-5.8699999999999997E-5,-2.3799999999999999E-5]
[null,"Heating Savings (kWh)",{"$f":"IF(AND(C19=\"Window Units\",C20=\"Electric Resistance\"),0.24,1)*IF(COUNTBLANK(C19:C26)>0,0,C25*INDEX(N5:P46,C28,MATCH(C21,N4:P4,0)))","v":0},null,null,"Roof Deck",null,"Roof Deck","Steep","R-19","0.5 – 0.69",0.22,0.08,-0.01,-0.28000000000000003,-0.11,8.9499999999999994E-5,4.4199999999999997E-5,1.1000000000000001E-6,-1.3100000000000001E-4,-5.3000000000000001E-5]
[null,"Total Savings (kWh)",{"$f":"IFERROR(SUM(C30:C31),0)","v":0},null,null,null,null,"Roof Deck","Steep","R-19",">= 0.7",0.35,0.12,-0.02,-0.45,-0.17,1.35E-4,4.4400000000000002E-5,-8.9500000000000001E-7,-2.1000000000000001E-4,-8.53E-5]
[null,null,null,null,null,"CeilRvalue",null,"Roof Deck","Steep","R-30","0.15 - 0.29",0.01,0.01,0,-0.01,-0.01,6.6599999999999998E-6,1.11E-6,-1.04E-7,-4.4499999999999997E-6,-1.81E-6]
[null,"Summer Demand Savings (kW)",{"$f":"IFERROR(IF(C20=\"Window Units\",0.6,1)*IF(COUNTBLANK(C19:C26)>0,0,C25*INDEX(Q5:R46,C28,MATCH(C19,Q4:R4,0))),0)","v":0},null,null,"≤ R-8",null,"Roof Deck","Steep","R-30","0.3 – 0.49",0.1,0.03,0,-0.12,-0.04,3.01E-5,5.2900000000000002E-6,4.8100000000000003E-7,-4.8099999999999997E-5,-1.95E-5]
[null,"Winter Demand Savings (kW)",{"$f":"IFERROR(IF(AND(C19=\"Window Units\",C20=\"Electric Resistance\"),0.24,1)*IF(COUNTBLANK(C19:C26)>0,0,C25*INDEX(S5:U46,C28,MATCH(C21,S4:U4,0))),0)","v":0},null,null,"R-9 to R-14",null,"Roof Deck","Steep","R-30","0.5 – 0.69",0.19,0.06,-0.01,-0.23,-0.09,6.6299999999999999E-5,1.8300000000000001E-5,-7.1200000000000002E-7,-1.01E-4,-4.1499999999999999E-5]
[null,null,null,null,null,"R-15 to R-22",null,"Roof Deck","Steep","R-30",">= 0.7",0.28000000000000003,0.1,-0.01,-0.37,-0.14000000000000001,1.05E-4,2.23E-5,-2.5100000000000001E-6,-1.6000000000000001E-4,-6.58E-5]
[null,null,null,null,null,"R-22 to R-30",null,"Roof Deck","Steep","R-38","0.15 - 0.29",0.02,0.01,0,-0.02,-0.01,1.15E-5,1.9099999999999999E-6,-1.79E-7,-7.6799999999999993E-6,-3.1300000000000001E-6]
[null,null,null,null,null,null,null,"Roof Deck","Steep","R-38","0.3 – 0.49",0.09,0.03,0,-0.11,-0.04,2.55E-5,-7.1500000000000002E-6,-6.75E-7,-4.0399999999999999E-5,-1.63E-5]
[null,null,null,null,null,"RoofRvalue",null,"Roof Deck","Steep","R-38","0.5 – 0.69",0.16,0.05,-0.01,-0.2,-0.08,4.9499999999999997E-5,-5.1900000000000003E-7,-2.03E-6,-7.9400000000000006E-5,-3.3099999999999998E-5]
[null,null,null,null,null,"R-19",null,"Roof Deck","Steep","R-38",">= 0.7",0.23,0.08,-0.01,-0.31,-0.12,8.3999999999999995E-5,6.2899999999999999E-6,-3.6799999999999999E-6,-1.2400000000000001E-4,-5.1600000000000001E-5]
[null,null,null,null,null,"R-30",null,"Roof Deck","Low","R-19","0.5 – 0.69",0.23,0.08,-0.01,-0.28999999999999998,-0.11,8.1100000000000006E-5,2.76E-5,7.9699999999999995E-7,-1.2999999999999999E-4,-5.3900000000000002E-5]
[null,null,null,null,null,"R-38",null,"Roof Deck","Low","R-19",">= 0.7",0.36,0.12,-0.02,-0.46,-0.18,1.3300000000000001E-4,2.3E-5,-1.19E-6,-2.13E-4,-8.8300000000000005E-5]
[null,null,null,null,null,null,null,"Roof Deck","Low","R-30","0.5 – 0.69",0.19,0.06,-0.01,-0.24,-0.09,5.6100000000000002E-5,1.0900000000000001E-5,3.7399999999999997E-8,-1.01E-4,-4.1600000000000002E-5]
[null,null,null,null,null,null,null,"Roof Deck","Low","R-30",">= 0.7",0.28999999999999998,0.1,-0.01,-0.38,-0.15,1.13E-4,1.29E-5,-1.64E-6,-1.6100000000000001E-4,-6.7299999999999996E-5]
[null,null,null,null,null,null,null,"Roof Deck","Low","R-38","0.5 – 0.69",0.16,0.05,-0.01,-0.21,-0.08,3.79E-5,-1.22E-6,-5.1500000000000005E-7,-7.9300000000000003E-5,-3.26E-5]
[null,null,null,null,null,null,null,"Roof Deck","Low","R-38",">= 0.7",0.24,0.08,-0.01,-0.32,-0.12,9.9199999999999999E-5,5.5999999999999997E-6,-1.9700000000000002E-6,-1.2400000000000001E-4,-5.1999999999999997E-5]

{"sheet":"Version Log","index":19,"n_rows":10,"n_cols":6,"rows_kept":10,"cut":false,"hidden":true,"merged":[[1,1,1,5]]}
[]
[null,"Version Log"]
[]
[null,"Original Author:",null,"Adam Groenhuyzen, Rodrigo Bonilla","QA/QC Engineer(s):","Adam Groenhuyzen, \nRodrigo Bonilla"]
[null,"Primary Developer:",null,null,"Senior Engineer Approval:","Boone Drummond"]
[]
[null,"Version","Date","Reason for Change","Change Description","Contact, Department"]
[null,20,"2020-05-19",null,"Initial creation","Adam Groenhuyzen, Rodrigo Bonilla"]
[null,21,"2020-12-16","Update","Fixed window unit factor on Insulation measures\nUpdated early retirement factors with 2020 values\nTRM v8.0 updates: \n-added HTR/LI space heater factor on heating savings for existing measures\n-added Cool Roofs measure\n-added Door Air Infiltration measure\n-hid Floor Insulation measure","Adam Groenhuyzen"]
[null,null,null,null,"Increased decimals on kW savings to 4"]